program: Orca
programVersion: 5.0.2
elementType: S P O O O O O N N N C C C C C C C C C C C C C C H H H H H H H H H H H H H H H H H H H H
charge: 0
multiplicity: 1
keywords: wb97x-d3
keywords: def2-TZVPP
keywords: def2/J RIJCOSX
keywords: DEFGRID2
keywords: scfconv7
keywords: smallprint printgap noloewdin
keywords: NOSOSCF
formula: C14H20N3O5PS
InChI: InChI=1/C14H20N3O5PS/c1-5-19-14(18)11-9-17-12(15-10(11)4)8-13(16-17)22-23(24,20-6-2)21-7-3/h8-9H,5-7H2,1-4H3
44 atoms
S  4.768138 1.341215 -0.889054
P  3.398914 0.16466 -0.279971
O  1.959387 0.496093 -0.948555
O  3.114338 0.128719 1.29174
O  3.539655 -1.386492 -0.614179
O  -5.119162 1.139684 -0.389562
O  -5.857437 -0.75341 0.530256
N  -1.298923 0.038847 -0.329156
N  -1.800339 -2.049427 0.676357
N  -0.279621 0.775256 -0.775761
C  -0.903613 -1.188014 0.18411
C  -3.522426 -0.469449 0.148387
C  -2.585077 0.396024 -0.350935
C  -3.066889 -1.732622 0.672461
C  0.768239 0.00895 -0.554613
C  0.466095 -1.225692 0.041514
C  -3.994672 -2.759021 1.241754
C  -4.94947 -0.075704 0.129819
C  3.256167 1.298258 2.10963
C  4.819237 -2.013945 -0.774083
C  -6.456235 1.642946 -0.467985
C  2.190147 2.337141 1.842033
C  5.580487 -2.131206 0.526409
C  -6.397905 3.009082 -1.108662
H  -2.803725 1.366297 -0.771144
H  1.126838 -2.026399 0.318427
H  -3.404192 -3.611474 1.566455
H  -4.557691 -2.370201 2.088894
H  -4.728576 -3.090474 0.50877
H  4.252785 1.721067 1.962215
H  3.191718 0.929114 3.132267
H  5.400816 -1.460252 -1.514259
H  4.595049 -2.99686 -1.185693
H  -7.074711 0.960201 -1.054541
H  -6.889177 1.695873 0.53335
H  1.189035 1.917431 1.93422
H  2.29127 2.777747 0.850518
H  2.285042 3.144012 2.569219
H  4.990143 -2.631984 1.292465
H  5.883448 -1.154161 0.901468
H  6.486567 -2.714832 0.362046
H  -7.404519 3.421277 -1.174487
H  -5.792304 3.702066 -0.525229
H  -5.991506 2.962608 -2.11864
totalener: -1825.68859626 hartree
nucrepener: 2463.52053158 hartree
electener: -4289.20912784 hartree
oneelecener: -7402.85775138 hartree
twoeener: 3113.64862354 hartree
kineticenergy: 1819.75795704 hartree
xcener: -138.293540234683 hartree
chargesum: -0.0000000
charge: -0.355724 0.663553 -0.268636 -0.305466 -0.306833 -0.282718 -0.369717 0.162866 -0.281456 -0.320703 0.149798 -0.132618 0.038064 0.141152 0.204773 -0.214116 -0.231672 0.425485 0.012678 -0.002745 0.030061 -0.236627 -0.221161 -0.236240 0.153950 0.137689 0.103031 0.096501 0.096508 0.094275 0.097113 0.097201 0.094705 0.090189 0.090291 0.084280 0.099939 0.091482 0.089471 0.081760 0.085119 0.084375 0.084515 0.085608
qa: -0.3557 0.6636 -0.2686 -0.3055 -0.3068 -0.2827 -0.3697 0.1629 -0.2815 -0.3207 0.1498 -0.1326 0.0381 0.1412 0.2048 -0.2141 -0.2317 0.4255 0.0127 -0.0027 0.0301 -0.2366 -0.2212 -0.2362 0.1539 0.1377 0.1030 0.0965 0.0965 0.0943 0.0971 0.0972 0.0947 0.0902 0.0903 0.0843 0.0999 0.0915 0.0895 0.0818 0.0851 0.0844 0.0845 0.0856
va: 2.0923 5.5190 2.1811 2.0710 2.1189 2.1093 2.1387 3.3734 3.1499 2.7580 4.1542 3.7028 4.0469 3.9353 4.2169 3.9301 3.9154 4.1612 3.8830 3.9058 3.8701 3.8895 3.8783 3.9539 1.0286 1.0269 1.0191 1.0070 1.0071 1.0125 0.9915 1.0112 0.9926 0.9989 0.9983 1.0088 1.0178 1.0125 1.0063 1.0237 1.0118 1.0093 1.0045 1.0046
dispcorr: -0.020403052 hartree
energy: -1825.708999314800
dipole: -9.18962 8.51858 -0.67104 2.54678 -2.44929 0.09750 8.95543 -8.27811 0.67731
magnitude: 0.95841 au
magnitude: 2.43609 debye
