program: Gaussian 09
title: 000066158
version: EM64L-G09RevD.01
frameworkgroup: C1[X(C20H21N3O)]
method: RPBEPBE
basis: SDD
operation: Freq
keyword: #p
keyword: freq=noraman
keyword: PBEPBE/SDD
title: #p freq=noraman PBEPBE/SDD
converged: YES YES NO NO
title: Mulliken charges:
elementType: O N N N C C C C C C C C C C C C C C C C C C C C H H H H H H H H H H H H H H H H H H H H H
charge: -0.458617 -0.700251 -0.698756 -0.702443 -0.111801 0.399337 0.354687 0.334829 -0.586123 -0.390529 0.312650 -0.397136 -0.367434 -0.383574 -0.349827 0.327300 -0.457071 -0.441827 -0.434835 -0.420542 -0.442895 0.491811 0.499202 -0.854256 0.257445 0.257922 0.261279 0.276704 0.272017 0.247625 0.338978 0.213284 0.212351 0.210542 0.210465 0.209437 0.221284 0.220022 0.246026 0.320384 0.301705 0.301078 0.300231 0.299534 0.299788
chargesum: 0.00000
title: Mulliken charges with hydrogens summed into heavy atoms:
elementType: O N N N C C C C C C C C C C C C C C C C C C C C
charge: -0.119639 -0.078163 -0.097447 -0.103121 -0.111801 0.399337 0.354687 0.334829 -0.328678 -0.132607 0.312650 -0.135857 -0.090730 -0.111557 -0.102202 0.327300 -0.243787 -0.229476 -0.224292 -0.210077 -0.233458 0.491811 0.499202 -0.166924
polarizability: 2.88634021e+02 1.21680656e+01 2.82257003e+02 -1.56176498e+00 4.74512132e+00 1.82357412e+02
1716.lowfreq: -5.6249 -4.4507 0.0004 0.0005 0.0006 4.8449 18.8523 29.7804 38.3266
frequency: 18.7731 29.7568 38.3140 45.4634 54.0510 62.3996 135.9674 148.1304 159.1360 175.3742 193.8003 214.0650 230.2213 235.2805 247.6577 277.7372 301.0405 303.5775 311.6090 317.2499 321.3869 328.7813 361.9390 364.9705 368.5557 372.1767 381.3700 394.5349 404.5166 410.2639 413.9297 436.4924 442.5509 490.7531 515.2893 536.8095 542.0158 574.7555 591.6783 610.0952 636.3212 637.2090 637.9841 728.8703 733.2662 740.4668 758.2593 807.9999 811.7715 814.6569 819.3168 820.1223 826.0909 826.8732 850.6913 886.0445 896.9112 932.1370 941.1865 948.0589 954.3525 961.5178 969.1100 973.7020 992.7642 1002.8516 1005.7387 1016.4316 1019.4655 1025.5990 1041.8916 1126.7486 1130.5624 1136.0840 1153.4872 1157.8223 1181.6154 1192.7375 1204.6742 1228.8884 1287.8769 1299.5461 1305.0547 1305.9922 1310.8153 1316.3888 1319.7337 1374.3232 1379.3889 1381.9220 1396.7448 1419.8683 1428.1209 1430.3053 1474.5938 1480.3110 1509.8303 1511.3813 1515.6633 1577.7033 1580.5802 1582.3835 1623.8977 1628.7533 1630.2895 1640.2020 1640.9420 1642.5916 2946.4752 3011.7226 3084.6807 3104.5713 3110.4238 3111.9009 3113.6409 3115.0164 3128.5132 3139.7051 3139.8677 3147.0063 3156.0917 3170.7090 3545.2684 3568.5295 3568.7638 3572.1857 3709.4291 3709.7708 3712.2663
redmass: 3.7607 3.6017 5.1342 4.5735 4.4684 4.0136 4.4114 4.1816 4.3132 1.2709 2.2546 4.6822 5.5374 3.3341 2.1254 1.8876 1.5272 2.0227 1.8119 2.1092 1.5018 2.4429 2.0118 1.4121 1.0581 3.5126 1.2762 2.9310 3.3096 2.7634 2.8437 2.8995 3.3484 4.3119 3.4853 3.4423 3.2030 4.1156 4.6796 3.5624 6.4998 6.7795 6.3797 3.5564 3.8444 3.6822 4.4495 2.2480 4.0430 1.7417 1.4561 1.3903 2.4091 1.8261 3.2860 3.7132 1.7743 2.8406 1.7855 1.4383 1.4063 1.8650 1.3804 1.4293 1.8497 2.8367 2.4977 1.4382 1.4544 1.5177 1.5124 1.2408 1.2727 1.9503 1.8590 1.3197 1.2233 1.1641 2.5677 3.0887 1.4158 1.5498 1.5452 1.9912 2.2340 2.0121 2.6429 4.5542 5.4419 4.3094 1.4512 3.4032 3.5454 3.5239 1.0470 1.2249 2.8903 3.0125 3.0140 6.8984 6.9797 7.0301 2.4928 2.4779 2.1416 1.6208 1.6502 1.7884 1.0396 1.0974 1.0950 1.0862 1.0879 1.0888 1.0886 1.0890 1.0959 1.0913 1.0945 1.0943 1.0943 1.0933 1.0657 1.0446 1.0447 1.0448 1.1040 1.1040 1.1036
irintensity: 0.0750 0.2012 1.2633 0.7538 2.3303 1.9789 1.9965 1.5115 2.0094 0.2237 0.6621 1.9421 2.0214 7.3703 30.2927 66.8035 169.1061 96.7280 125.3119 244.5740 154.2980 157.6886 2.7571 1.3840 0.4125 4.2438 20.0210 7.0422 9.4258 0.0874 1.8458 2.2012 1.2638 4.3746 1.3421 3.8598 10.0028 28.3860 37.7350 9.1494 1.3382 0.6564 1.5292 1.9881 0.5829 3.3403 13.0086 53.2688 3.9618 41.4998 2.3509 9.4006 59.8677 69.5172 9.8418 16.4550 29.9109 16.1694 7.5937 2.5919 2.9072 7.2728 2.4010 1.2537 1.7899 2.6020 0.3976 1.9665 4.3407 5.4068 3.2814 11.9463 20.4828 24.6657 76.4995 16.0491 91.9459 28.5798 6.2996 31.2203 33.2629 8.9861 21.1539 36.6584 51.5365 40.3347 133.3711 10.2543 10.7701 25.4857 19.1675 8.4995 1.2911 1.5337 10.5156 11.9679 150.8589 140.3391 98.2581 5.0219 12.8071 34.3068 0.5482 13.3171 1.3537 338.0716 409.6393 116.2738 55.1930 27.9031 12.9009 22.5681 16.5065 20.5111 45.9000 35.0445 27.2656 2.0789 13.2007 12.7227 5.5677 4.6087 6.8690 94.6558 50.9661 64.3508 18.1899 17.8162 20.4415
temp: 298.150 k
press: 1.00000 atm
elementType: 8 7 7 7 6 6 6 6 6 6 6 6 6 6 6 6 6 6 6 6 6 6 6 6 1 1 1 1 1 1 1 1 1 1 1 1 1 1 1 1 1 1 1 1 1
symmnumber: 1
zpe: 955544.1 jmol-1
zpe.correction: 0.363948 hartree
zpe.thermalcorrener: 0.387130 hartree
zpe.thermalcorrenthalpy: 0.388074 hartree
zpe.thermalcorrgfe: 0.311499 hartree
zpe.sumelectzpe: -1012.517488 hartree
zpe.sumelectthermal: -1012.494306 hartree
zpe.sumelectthermalent: -1012.493362 hartree
zpe.sumelectthermalfe: -1012.569937 hartree
dipole: 0.8311 -1.1233 -2.6410
dipole: 2.9879
quadrupole: -104.5607 -106.4243 -137.9168
quadrupole: 1.3388 2.3188 -1.8346
quadrupole: 11.7399 9.8763 -21.6162 1.3388 2.3188 -1.8346
hfenergy: -1012.881436 hartree
pointgroup: C01 [X(C20H21N3O1)]
dipole: -0.3508542 0.3411359 -1.0688387 debye
polarizability: 290.591704|10.1291292|277.0700019|-7.421574|-17.4607702|185.5867301 unknown
InChI: InChI=1S/C20H21N3O/c1-13-12-16(6-11-19(13)23)20(24,14-2-7-17(21)8-3-14)15-4-9-18(22)10-5-15/h2-12,24H,21-23H2,1H3
charge 0 multiplicity 1
45 atoms
O  0.374481 0.29312 2.347854
N  -4.423387 3.290133 -0.518305
N  5.297797 1.847045 -1.510236
N  -0.518289 -5.53964 -0.039814
C  0.265255 0.147006 0.852715
C  -0.970839 0.955216 0.400243
C  1.576279 0.657787 0.217461
C  0.100017 -1.367049 0.627156
C  -2.196628 0.34582 0.03951
C  -0.931613 2.375472 0.440621
C  -3.35521 1.089914 -0.273709
C  1.630527 1.24743 -1.069869
C  -0.474718 -2.189606 1.627554
C  2.802075 0.459968 0.90412
C  0.461264 -1.972679 -0.601295
C  -3.295332 2.518804 -0.218144
C  -2.068769 3.145549 0.14091
C  2.854306 1.641712 -1.648521
C  -0.677112 -3.567668 1.417095
C  4.031002 0.851683 0.34338
C  0.256516 -3.347174 -0.830877
C  4.079238 1.453079 -0.948412
C  -0.317283 -4.172147 0.178652
C  -4.649989 0.39842 -0.660081
H  -2.251612 -0.747401 -0.00179
H  0.007026 2.887346 0.688025
H  0.702033 1.408951 -1.629354
H  -0.744705 -1.733586 2.584045
H  2.773871 -0.006948 1.894005
H  0.923693 -1.366414 -1.387599
H  0.29465 1.261497 2.547873
H  -2.0123 4.241044 0.176924
H  2.863766 2.099369 -2.646087
H  -1.114518 -4.182852 2.214058
H  4.962934 0.691112 0.900727
H  0.550938 -3.789603 -1.791205
H  -5.471351 0.633249 0.048222
H  -4.992397 0.694737 -1.673207
H  -4.524916 -0.69696 -0.663626
H  -5.305435 2.85485 -0.767029
H  -4.381215 4.303705 -0.474325
H  6.170182 1.703612 -1.011049
H  5.334049 2.264965 -2.434802
H  -0.242045 -5.972152 -0.915805
H  -0.903036 -6.130918 0.690291
