program: Orca
programVersion: 5.0.2
elementType: S P O O O O O N N N C C C C C C C C C C C C C C H H H H H H H H H H H H H H H H H H H H
charge: 0
multiplicity: 1
keywords: wb97x-d3
keywords: def2-TZVPP
keywords: def2/J RIJCOSX
keywords: DEFGRID2
keywords: scfconv7
keywords: smallprint printgap noloewdin
keywords: NOSOSCF
formula: C14H20N3O5PS
InChI: InChI=1/C14H20N3O5PS/c1-5-19-14(18)11-9-17-12(15-10(11)4)8-13(16-17)22-23(24,20-6-2)21-7-3/h8-9H,5-7H2,1-4H3
44 atoms
S  3.290391 0.491326 2.020558
P  3.270556 -0.011484 0.176896
O  1.92474 0.3479 -0.660229
O  3.419081 -1.558449 -0.162889
O  4.358165 0.648885 -0.774676
O  -5.151298 1.065597 -1.194548
O  -6.041763 -0.39257 0.238928
N  -1.395064 0.098745 -0.315284
N  -2.070051 -1.510138 1.290801
N  -0.309551 0.640982 -0.871597
C  -1.098492 -0.865495 0.636835
C  -3.67249 -0.233093 0.051091
C  -2.658885 0.413422 -0.606535
C  -3.317851 -1.228683 1.030404
C  0.68126 0.015065 -0.272489
C  0.2760 -0.935936 0.677388
C  -4.333685 -2.002263 1.810215
C  -5.075769 0.112609 -0.266557
C  4.193544 -2.444063 0.656432
C  4.688019 2.043683 -0.710681
C  -6.453725 1.499747 -1.594689
C  5.680889 -2.20733 0.525496
C  6.18663 2.199058 -0.800768
C  -6.275186 2.578299 -2.63668
H  -2.800034 1.17519 -1.358526
H  0.872835 -1.564396 1.312588
H  -4.991158 -2.576398 1.159186
H  -3.80815 -2.681253 2.476395
H  -4.975333 -1.348434 2.398836
H  3.925669 -3.442228 0.313117
H  3.877134 -2.345057 1.697568
H  4.315502 2.478752 0.220207
H  4.186246 2.54196 -1.54175
H  -7.018903 0.655036 -1.99474
H  -7.000982 1.876668 -0.727863
H  6.000361 -2.244647 -0.515135
H  6.219071 -2.981253 1.073193
H  5.972347 -1.244819 0.945407
H  6.444889 3.25805 -0.806268
H  6.581501 1.752626 -1.712762
H  6.680658 1.737959 0.053835
H  -7.252177 2.930951 -2.96625
H  -5.72945 3.433693 -2.239345
H  -5.743044 2.206651 -3.511951
totalener: -1825.69041297 hartree
nucrepener: 2427.95097926 hartree
electener: -4253.64139223 hartree
oneelecener: -7331.90833651 hartree
twoeener: 3078.26694429 hartree
kineticenergy: 1819.76069677 hartree
xcener: -138.293046364662 hartree
chargesum: -0.0000000
charge: -0.373657 0.686924 -0.284371 -0.314937 -0.311536 -0.282650 -0.370402 0.149279 -0.281596 -0.319500 0.136502 -0.134637 0.040637 0.142162 0.282247 -0.220957 -0.231838 0.425612 0.020269 0.028102 0.030635 -0.226729 -0.225336 -0.238638 0.150967 0.114782 0.095991 0.102719 0.096263 0.099104 0.090551 0.082290 0.099737 0.090287 0.090417 0.092828 0.085605 0.077558 0.081484 0.087348 0.081630 0.083898 0.085620 0.085337
qa: -0.3737 0.6869 -0.2844 -0.3149 -0.3115 -0.2827 -0.3704 0.1493 -0.2816 -0.3195 0.1365 -0.1346 0.0406 0.1422 0.2822 -0.2210 -0.2318 0.4256 0.0203 0.0281 0.0306 -0.2267 -0.2253 -0.2386 0.1510 0.1148 0.0960 0.1027 0.0963 0.0991 0.0906 0.0823 0.0997 0.0903 0.0904 0.0928 0.0856 0.0776 0.0815 0.0873 0.0816 0.0839 0.0856 0.0853
va: 2.0490 5.5452 2.2061 2.1144 2.1369 2.1087 2.1379 3.4098 3.1529 2.7940 4.2200 3.7070 4.0504 3.9349 4.1652 3.9793 3.9153 4.1630 3.8846 3.8591 3.8699 3.9077 3.9348 3.9533 1.0296 1.0306 1.0069 1.0189 1.0071 0.9909 1.0111 1.0184 0.9948 0.9987 0.9987 1.0066 1.0115 1.0196 1.0111 1.0048 1.0081 1.0094 1.0044 1.0044
dispcorr: -0.019268523 hartree
energy: -1825.709681492220
dipole: 2.26449 -2.05963 0.20486 3.51538 -3.15290 0.36248 -5.96360 5.04922 -0.91437
magnitude: 1.00470 au
magnitude: 2.55376 debye
