program: Orca
programVersion: 5.0.2
elementType: S P O O O O O N N N C C C C C C C C C C C C C C H H H H H H H H H H H H H H H H H H H H
charge: 0
multiplicity: 1
keywords: wb97x-d3
keywords: def2-TZVPP
keywords: def2/J RIJCOSX
keywords: DEFGRID2
keywords: scfconv7
keywords: smallprint printgap noloewdin
keywords: NOSOSCF
formula: C14H20N3O5PS
InChI: InChI=1/C14H20N3O5PS/c1-5-19-14(18)11-9-17-12(15-10(11)4)8-13(16-17)22-23(24,20-6-2)21-7-3/h8-9H,5-7H2,1-4H3
44 atoms
S  3.407504 0.647312 1.798804
P  3.307605 0.027262 -0.007405
O  1.930902 0.362492 -0.803069
O  3.413608 -1.540036 -0.254475
O  4.35559 0.611151 -1.048288
O  -5.159389 0.948906 -1.245143
O  -6.003201 -0.418053 0.302154
N  -1.376198 0.123553 -0.348698
N  -1.995373 -1.250658 1.482792
N  -0.31025 0.594464 -0.999354
C  -1.046869 -0.698336 0.718927
C  -3.640402 -0.181082 0.10966
C  -2.650057 0.379668 -0.653215
C  -3.25209 -1.020208 1.214786
C  0.701896 0.065864 -0.344891
C  0.329175 -0.75063 0.735478
C  -4.241593 -1.671436 2.128953
C  -5.053935 0.08263 -0.238386
C  4.105054 -2.414455 0.646688
C  4.755601 1.99129 -1.013557
C  -6.473649 1.268228 -1.709671
C  5.606765 -2.275909 0.548703
C  6.130718 2.125329 -0.402849
C  -6.328459 2.258207 -2.840313
H  -2.817088 1.024944 -1.502455
H  0.946634 -1.274934 1.441603
H  -4.890041 -2.364318 1.594724
H  -3.694122 -2.214417 2.894777
H  -4.894594 -0.941919 2.605912
H  3.783912 -3.415498 0.362249
H  3.766621 -2.226793 1.668574
H  4.031262 2.591511 -0.457862
H  4.743026 2.330642 -2.049112
H  -6.979173 0.35931 -2.043678
H  -7.063855 1.68728 -0.891862
H  5.941095 -1.299763 0.899977
H  5.954607 -2.417293 -0.47374
H  6.081474 -3.031173 1.175659
H  6.862974 1.522794 -0.939604
H  6.122226 1.820042 0.642844
H  6.45299 3.165876 -0.44785
H  -7.314354 2.525168 -3.219928
H  -5.839465 3.174325 -2.510249
H  -5.755116 1.840941 -3.667735
totalener: -1825.68965901 hartree
nucrepener: 2434.12281833 hartree
electener: -4259.81247733 hartree
oneelecener: -7344.24305196 hartree
twoeener: 3084.43057462 hartree
kineticenergy: 1819.75989383 hartree
xcener: -138.293401668614 hartree
chargesum: 0.0000000
charge: -0.379723 0.696694 -0.281558 -0.316288 -0.313504 -0.282657 -0.370286 0.149355 -0.281714 -0.321076 0.126167 -0.133150 0.039526 0.141866 0.285485 -0.215768 -0.233209 0.424681 0.023849 0.029266 0.030477 -0.226166 -0.233486 -0.237995 0.151418 0.113608 0.097291 0.103033 0.095403 0.099477 0.088635 0.085736 0.096913 0.090624 0.090196 0.077402 0.093139 0.085377 0.086780 0.084140 0.085456 0.084066 0.085896 0.084621
qa: -0.3797 0.6967 -0.2816 -0.3163 -0.3135 -0.2827 -0.3703 0.1494 -0.2817 -0.3211 0.1262 -0.1331 0.0395 0.1419 0.2855 -0.2158 -0.2332 0.4247 0.0238 0.0293 0.0305 -0.2262 -0.2335 -0.2380 0.1514 0.1136 0.0973 0.1030 0.0954 0.0995 0.0886 0.0857 0.0969 0.0906 0.0902 0.0774 0.0931 0.0854 0.0868 0.0841 0.0855 0.0841 0.0859 0.0846
va: 2.0347 5.5386 2.2138 2.1171 2.1304 2.1086 2.1380 3.4084 3.1523 2.7929 4.2410 3.7046 4.0501 3.9346 4.1617 3.9822 3.9162 4.1630 3.8873 3.8865 3.8700 3.9112 3.9120 3.9535 1.0295 1.0325 1.0071 1.0190 1.0070 0.9910 1.0105 1.0103 0.9959 0.9988 0.9986 1.0178 1.0065 1.0118 1.0032 1.0193 1.0132 1.0094 1.0045 1.0044
dispcorr: -0.019520143 hartree
energy: -1825.709179152434
dipole: 1.55584 -1.40922 0.14662 2.32867 -2.07863 0.25005 -4.33776 3.47616 -0.86160
magnitude: 0.90905 au
magnitude: 2.31063 debye
