program: Orca
programVersion: 5.0.2
elementType: S P O O O O O N N N C C C C C C C C C C C C C C H H H H H H H H H H H H H H H H H H H H
charge: 0
multiplicity: 1
keywords: wb97x-d3
keywords: def2-TZVPP
keywords: def2/J RIJCOSX
keywords: DEFGRID2
keywords: scfconv7
keywords: smallprint printgap noloewdin
keywords: NOSOSCF
formula: C14H20N3O5PS
InChI: InChI=1/C14H20N3O5PS/c1-5-19-14(18)11-9-17-12(15-10(11)4)8-13(16-17)22-23(24,20-6-2)21-7-3/h8-9H,5-7H2,1-4H3
44 atoms
S  4.7897 1.651814 0.345021
P  3.376464 0.378374 0.461265
O  1.965799 1.063053 0.873431
O  3.498681 -0.761654 1.569463
O  3.035811 -0.475217 -0.845262
O  -4.846226 0.984104 -1.253219
O  -5.799096 -0.756006 -0.226039
N  -1.246607 0.304229 0.28727
N  -1.94226 -1.718785 1.308862
N  -0.182266 1.092412 0.126807
C  -0.981161 -0.826615 1.046649
C  -3.46794 -0.359872 0.056884
C  -2.466857 0.537659 -0.202046
C  -3.148567 -1.520248 0.85071
C  0.762033 0.464143 0.795419
C  0.350102 -0.736562 1.39098
C  -4.156953 -2.568456 1.200661
C  -4.82582 -0.095027 -0.471172
C  4.771631 -1.26054 2.001275
C  3.237523 0.039834 -2.169211
C  -6.101433 1.387012 -1.811858
C  5.47901 -2.069814 0.937957
C  2.225222 1.095342 -2.553008
C  -6.461201 0.597881 -3.052105
H  -2.584616 1.44275 -0.778697
H  0.922341 -1.423089 1.987355
H  -3.657468 -3.348193 1.76933
H  -4.971743 -2.158894 1.795856
H  -4.611766 -3.007381 0.313912
H  4.546335 -1.87426 2.872523
H  5.392992 -0.423229 2.327122
H  3.156587 -0.831391 -2.818193
H  4.254093 0.431938 -2.251513
H  -6.888215 1.311989 -1.059637
H  -5.96456 2.440473 -2.053847
H  5.788879 -1.446396 0.099301
H  4.849257 -2.875163 0.561879
H  6.378416 -2.514596 1.364721
H  2.34397 2.004204 -1.963611
H  1.203725 0.738973 -2.429342
H  2.367885 1.361692 -3.600883
H  -6.649409 -0.44956 -2.824847
H  -7.370188 1.011249 -3.490134
H  -5.673882 0.658951 -3.803105
totalener: -1825.68779536 hartree
nucrepener: 2470.45833442 hartree
electener: -4296.14612979 hartree
oneelecener: -7416.80686803 hartree
twoeener: 3120.66073825 hartree
kineticenergy: 1819.75868489 hartree
xcener: -138.293494130136 hartree
chargesum: 0.0000000
charge: -0.362029 0.681358 -0.283604 -0.313860 -0.308927 -0.285028 -0.376310 0.168808 -0.282511 -0.347856 0.187688 -0.145707 0.040207 0.142521 0.239368 -0.262936 -0.231398 0.441354 0.004024 0.018781 0.032034 -0.223176 -0.234436 -0.252719 0.153795 0.146420 0.103764 0.098492 0.094009 0.091331 0.096751 0.095728 0.091320 0.090161 0.096723 0.080870 0.090553 0.084424 0.097424 0.084252 0.089176 0.101158 0.084789 0.083215
qa: -0.3620 0.6814 -0.2836 -0.3139 -0.3089 -0.2850 -0.3763 0.1688 -0.2825 -0.3479 0.1877 -0.1457 0.0402 0.1425 0.2394 -0.2629 -0.2314 0.4414 0.0040 0.0188 0.0320 -0.2232 -0.2344 -0.2527 0.1538 0.1464 0.1038 0.0985 0.0940 0.0913 0.0968 0.0957 0.0913 0.0902 0.0967 0.0809 0.0906 0.0844 0.0974 0.0843 0.0892 0.1012 0.0848 0.0832
va: 2.0829 5.5192 2.1774 2.1223 2.0778 2.1118 2.1248 3.3641 3.1462 2.7426 4.0530 3.7093 4.0454 3.9326 4.1778 3.9225 3.9143 4.1555 3.9082 3.8829 3.8677 3.8736 3.8892 3.9102 1.0307 1.0169 1.0190 1.0073 1.0073 0.9923 1.0109 0.9909 1.0132 1.0109 0.9950 1.0238 1.0068 1.0117 1.0189 1.0135 1.0127 1.0126 1.0099 1.0055
dispcorr: -0.020632020 hartree
energy: -1825.708427381619
dipole: -9.53634 8.81032 -0.72601 -8.21532 7.67187 -0.54345 -14.17732 13.14755 -1.02978
magnitude: 1.37218 au
magnitude: 3.48780 debye
