program: Orca
programVersion: 5.0.2
elementType: S P O O O O O N N N C C C C C C C C C C C C C C H H H H H H H H H H H H H H H H H H H H
charge: 0
multiplicity: 1
keywords: wb97x-d3
keywords: def2-TZVPP
keywords: def2/J RIJCOSX
keywords: DEFGRID2
keywords: scfconv7
keywords: smallprint printgap noloewdin
keywords: NOSOSCF
formula: C14H20N3O5PS
InChI: InChI=1/C14H20N3O5PS/c1-5-19-14(18)11-9-17-12(15-10(11)4)8-13(16-17)22-23(24,20-6-2)21-7-3/h8-9H,5-7H2,1-4H3
44 atoms
S  3.558093 -0.543137 -1.740555
P  3.299873 0.201789 0.003322
O  2.092047 -0.419598 0.893215
O  2.954506 1.749115 0.09802
O  4.496706 0.039558 1.038819
O  -4.833545 1.37498 0.736408
O  -5.838546 -0.184067 -0.509523
N  -1.205884 -0.190486 0.296791
N  -1.983117 -1.838536 -1.223733
N  -0.100332 0.25162 0.897525
C  -0.978283 -1.267429 -0.550881
C  -3.477365 -0.259896 -0.217755
C  -2.433866 0.309548 0.461094
C  -3.196061 -1.379548 -1.082218
C  0.83263 -0.549904 0.429466
C  0.374151 -1.515584 -0.475028
C  -4.253204 -2.083617 -1.872497
C  -4.840908 0.284628 -0.030805
C  3.447008 2.699577 -0.853473
C  5.363924 -1.100806 1.030803
C  -6.087741 1.99602 1.033566
C  4.930868 2.951509 -0.70979
C  4.68442 -2.356513 1.529529
C  -6.810627 1.308646 2.171818
H  -2.521883 1.146869 1.136805
H  0.941036 -2.265643 -0.995689
H  -5.008736 -2.530411 -1.22797
H  -4.779552 -1.404506 -2.541554
H  -3.777596 -2.864994 -2.459135
H  2.876906 3.60669 -0.657829
H  3.208004 2.35903 -1.863672
H  6.191736 -0.822994 1.681923
H  5.758993 -1.248842 0.022825
H  -5.827647 3.018749 1.304129
H  -6.711614 2.030677 0.139377
H  5.226047 3.76356 -1.374649
H  5.515193 2.073725 -0.985461
H  5.189937 3.236821 0.309028
H  4.231937 -2.203529 2.508344
H  5.422265 -3.15432 1.617846
H  3.913148 -2.699287 0.840379
H  -6.189837 1.261481 3.066193
H  -7.709929 1.872501 2.421772
H  -7.116934 0.299007 1.904303
totalener: -1825.68857996 hartree
nucrepener: 2454.98927158 hartree
electener: -4280.67785154 hartree
oneelecener: -7386.18337903 hartree
twoeener: 3105.50552749 hartree
kineticenergy: 1819.77610568 hartree
xcener: -138.295778316637 hartree
chargesum: 0.0000000
charge: -0.388995 0.699678 -0.304989 -0.308708 -0.313463 -0.284733 -0.376786 0.157321 -0.280552 -0.320369 0.178545 -0.145829 0.043417 0.138532 0.259769 -0.252244 -0.230327 0.440266 0.013656 0.018916 0.030332 -0.227765 -0.225602 -0.251363 0.152120 0.139201 0.096805 0.095128 0.103901 0.095788 0.092522 0.096143 0.090416 0.097069 0.089955 0.084049 0.080369 0.091469 0.092908 0.084647 0.079782 0.083680 0.084390 0.100951
qa: -0.3890 0.6997 -0.3050 -0.3087 -0.3135 -0.2847 -0.3768 0.1573 -0.2806 -0.3204 0.1785 -0.1458 0.0434 0.1385 0.2598 -0.2522 -0.2303 0.4403 0.0137 0.0189 0.0303 -0.2278 -0.2256 -0.2514 0.1521 0.1392 0.0968 0.0951 0.1039 0.0958 0.0925 0.0961 0.0904 0.0971 0.0900 0.0840 0.0804 0.0915 0.0929 0.0846 0.0798 0.0837 0.0844 0.1010
va: 2.0358 5.5348 2.1627 2.1562 2.1224 2.1116 2.1244 3.3731 3.1440 2.7791 4.1068 3.7071 4.0516 3.9362 4.1573 3.9601 3.9145 4.1579 3.9036 3.8875 3.8647 3.8921 3.8996 3.9142 1.0318 1.0163 1.0074 1.0071 1.0190 0.9921 1.0120 0.9913 1.0132 0.9947 1.0114 1.0113 1.0195 1.0067 1.0071 1.0117 1.0179 1.0056 1.0099 1.0115
dispcorr: -0.019778496 hartree
energy: -1825.708358452770
dipole: -4.25424 4.15316 -0.10107 5.05506 -4.11122 0.94384 4.85566 -4.13210 0.72355
magnitude: 1.19356 au
magnitude: 3.03378 debye
