program: Orca
programVersion: 5.0.2
elementType: S P O O O O O N N N C C C C C C C C C C C C C C H H H H H H H H H H H H H H H H H H H H
charge: 0
multiplicity: 1
keywords: wb97x-d3
keywords: def2-TZVPP
keywords: def2/J RIJCOSX
keywords: DEFGRID2
keywords: scfconv7
keywords: smallprint printgap noloewdin
keywords: NOSOSCF
formula: C14H20N3O5PS
InChI: InChI=1/C14H20N3O5PS/c1-5-19-14(18)11-9-17-12(15-10(11)4)8-13(16-17)22-23(24,20-6-2)21-7-3/h8-9H,5-7H2,1-4H3
44 atoms
S  2.996362 1.441654 1.390453
P  3.237482 0.016895 0.14008
O  1.947777 -0.358313 -0.776337
O  3.612536 -1.415142 0.725321
O  4.32122 0.206955 -1.007099
O  -5.065226 0.66788 -1.505355
O  -6.024268 -0.135372 0.341615
N  -1.370097 -0.203703 -0.348839
N  -2.106119 -1.122309 1.709471
N  -0.268714 0.039287 -1.061743
C  -1.11162 -0.813914 0.870139
C  -3.652886 -0.224541 0.115778
C  -2.617465 0.08543 -0.725107
C  -3.338458 -0.850151 1.375508
C  0.693356 -0.427948 -0.296218
C  0.25557 -0.974833 0.918903
C  -4.382217 -1.225895 2.379153
C  -5.03658 0.091843 -0.303854
C  4.37581 -1.560346 1.930955
C  4.404878 1.439333 -1.74238
C  -6.343197 1.032947 -2.033443
C  5.826932 -1.177191 1.751862
C  5.585569 2.25734 -1.277054
C  -6.11343 1.691346 -3.37268
H  -2.726993 0.555704 -1.690572
H  0.832083 -1.417213 1.710872
H  -4.96065 -0.362218 2.703818
H  -5.096114 -1.940838 1.972704
H  -3.886836 -1.666918 3.239985
H  4.279673 -2.612981 2.193752
H  3.915464 -0.967442 2.724903
H  3.480215 2.013493 -1.644838
H  4.505634 1.153595 -2.789281
H  -6.969077 0.143405 -2.133616
H  -6.848996 1.711437 -1.343077
H  6.376004 -1.410841 2.664401
H  5.939719 -0.109229 1.565949
H  6.286335 -1.7251 0.930291
H  5.675865 3.152398 -1.893115
H  6.515324 1.695515 -1.362956
H  5.458176 2.571453 -0.241778
H  -5.505219 2.590531 -3.278164
H  -5.623658 1.016204 -4.073881
H  -7.07117 1.981506 -3.803756
totalener: -1825.68976446 hartree
nucrepener: 2438.93462960 hartree
electener: -4264.62439407 hartree
oneelecener: -7353.93482660 hartree
twoeener: 3089.31043253 hartree
kineticenergy: 1819.76473057 hartree
xcener: -138.292576190091 hartree
chargesum: 0.0000000
charge: -0.374078 0.697350 -0.291468 -0.321640 -0.315303 -0.282923 -0.369616 0.152347 -0.282597 -0.316280 0.180357 -0.136932 0.043684 0.142988 0.263161 -0.263370 -0.231364 0.426169 0.013409 0.031029 0.030003 -0.222738 -0.232428 -0.238251 0.151705 0.129819 0.096668 0.096125 0.102719 0.099570 0.093164 0.086487 0.095970 0.090470 0.090502 0.084883 0.078336 0.092251 0.084903 0.084787 0.085227 0.085171 0.085295 0.084440
qa: -0.3741 0.6974 -0.2915 -0.3216 -0.3153 -0.2829 -0.3696 0.1523 -0.2826 -0.3163 0.1804 -0.1369 0.0437 0.1430 0.2632 -0.2634 -0.2314 0.4262 0.0134 0.0310 0.0300 -0.2227 -0.2324 -0.2383 0.1517 0.1298 0.0967 0.0961 0.1027 0.0996 0.0932 0.0865 0.0960 0.0905 0.0905 0.0849 0.0783 0.0923 0.0849 0.0848 0.0852 0.0852 0.0853 0.0844
va: 2.0429 5.5322 2.1863 2.1209 2.1246 2.1082 2.1394 3.4038 3.1509 2.7860 4.1268 3.7100 4.0467 3.9330 4.1845 3.9668 3.9176 4.1613 3.8865 3.8954 3.8707 3.9114 3.9135 3.9539 1.0296 1.0177 1.0070 1.0069 1.0190 0.9906 1.0111 1.0078 0.9957 0.9982 0.9990 1.0115 1.0183 1.0065 1.0130 1.0036 1.0205 1.0044 1.0043 1.0095
dispcorr: -0.019634529 hartree
energy: -1825.709398991637
dipole: 1.67835 -1.51751 0.16084 5.38472 -5.21422 0.17051 -4.85114 4.00575 -0.84539
magnitude: 0.87728 au
magnitude: 2.22988 debye
