program: Orca
programVersion: 5.0.2
elementType: S P O O O O O N N N C C C C C C C C C C C C C C H H H H H H H H H H H H H H H H H H H H
charge: 0
multiplicity: 1
keywords: wb97x-d3
keywords: def2-TZVPP
keywords: def2/J RIJCOSX
keywords: DEFGRID2
keywords: scfconv7
keywords: smallprint printgap noloewdin
keywords: NOSOSCF
formula: C14H20N3O5PS
InChI: InChI=1/C14H20N3O5PS/c1-5-19-14(18)11-9-17-12(15-10(11)4)8-13(16-17)22-23(24,20-6-2)21-7-3/h8-9H,5-7H2,1-4H3
44 atoms
S  4.786662 1.692403 -0.15388
P  3.404515 0.476414 0.339049
O  1.942597 1.177752 0.371268
O  3.459091 -0.168794 1.794099
O  3.209357 -0.814988 -0.582053
O  -5.043716 1.022339 -1.006699
O  -5.818644 -0.898504 -0.170244
N  -1.285944 0.342306 0.083132
N  -1.829854 -1.743354 1.071245
N  -0.260951 1.166747 -0.141262
C  -0.922995 -0.808591 0.767693
C  -3.499701 -0.383859 0.020807
C  -2.551659 0.55731 -0.283089
C  -3.076672 -1.567704 0.725827
C  0.756751 0.54309 0.414962
C  0.430265 -0.691879 0.997322
C  -4.017977 -2.665657 1.109095
C  -4.905209 -0.146518 -0.381173
C  4.699416 -0.408332 2.472312
C  3.458415 -0.774027 -1.994684
C  -6.345876 1.387101 -1.474452
C  5.489612 -1.544965 1.863605
C  2.426799 0.029239 -2.755157
C  -6.66955 0.756334 -2.811773
H  -2.746272 1.481573 -0.805898
H  1.065119 -1.38888 1.51303
H  -3.451712 -3.43964 1.620267
H  -4.80887 -2.308225 1.767006
H  -4.511236 -3.098231 0.239862
H  4.41369 -0.636075 3.498151
H  5.287773 0.512112 2.479858
H  3.446257 -1.817156 -2.307834
H  4.461054 -0.376956 -2.170726
H  -7.099419 1.130496 -0.728977
H  -6.310431 2.472249 -1.559901
H  5.850593 -1.293154 0.866684
H  4.895866 -2.456226 1.800349
H  6.36124 -1.751542 2.485222
H  2.471857 1.089342 -2.506214
H  1.416118 -0.329813 -2.563606
H  2.618914 -0.063113 -3.824503
H  -6.749147 -0.326969 -2.739227
H  -7.627881 1.135833 -3.167806
H  -5.91646 1.003417 -3.559771
totalener: -1825.68800358 hartree
nucrepener: 2466.68053632 hartree
electener: -4292.36853990 hartree
oneelecener: -7409.20460999 hartree
twoeener: 3116.83607008 hartree
kineticenergy: 1819.75219177 hartree
xcener: -138.293207878954 hartree
chargesum: -0.0000000
charge: -0.355688 0.663205 -0.268768 -0.306183 -0.306825 -0.284140 -0.377037 0.162021 -0.282036 -0.319337 0.149451 -0.146274 0.039950 0.139436 0.203746 -0.212070 -0.231436 0.442632 -0.002934 0.013822 0.030911 -0.219765 -0.237842 -0.251366 0.153738 0.136710 0.103237 0.096928 0.095471 0.095131 0.097100 0.096633 0.094400 0.089697 0.097473 0.081077 0.088493 0.085416 0.100661 0.084408 0.091933 0.100332 0.084501 0.083188
qa: -0.3557 0.6632 -0.2688 -0.3062 -0.3068 -0.2841 -0.3770 0.1620 -0.2820 -0.3193 0.1495 -0.1463 0.0400 0.1394 0.2037 -0.2121 -0.2314 0.4426 -0.0029 0.0138 0.0309 -0.2198 -0.2378 -0.2514 0.1537 0.1367 0.1032 0.0969 0.0955 0.0951 0.0971 0.0966 0.0944 0.0897 0.0975 0.0811 0.0885 0.0854 0.1007 0.0844 0.0919 0.1003 0.0845 0.0832
va: 2.0938 5.5202 2.1806 2.1198 2.0692 2.1118 2.1248 3.3751 3.1494 2.7581 4.1568 3.7047 4.0463 3.9378 4.2160 3.9318 3.9132 4.1572 3.9054 3.8813 3.8653 3.8818 3.8899 3.9146 1.0314 1.0270 1.0191 1.0070 1.0075 0.9922 1.0115 0.9916 1.0132 1.0116 0.9947 1.0227 1.0063 1.0117 1.0177 1.0084 1.0124 1.0116 1.0100 1.0056
dispcorr: -0.020663734 hartree
energy: -1825.708667314469
dipole: -9.33827 8.69448 -0.64379 -9.88150 9.27998 -0.60152 -9.38036 8.82924 -0.55113
magnitude: 1.03925 au
magnitude: 2.64156 debye
