program: Orca
programVersion: 5.0.2
elementType: S P O O O O O N N N C C C C C C C C C C C C C C H H H H H H H H H H H H H H H H H H H H
charge: 0
multiplicity: 1
keywords: wb97x-d3
keywords: def2-TZVPP
keywords: def2/J RIJCOSX
keywords: DEFGRID2
keywords: scfconv7
keywords: smallprint printgap noloewdin
keywords: NOSOSCF
formula: C14H20N3O5PS
InChI: InChI=1/C14H20N3O5PS/c1-5-19-14(18)11-9-17-12(15-10(11)4)8-13(16-17)22-23(24,20-6-2)21-7-3/h8-9H,5-7H2,1-4H3
44 atoms
S  3.278881 1.180299 1.641849
P  3.289416 0.004799 0.133465
O  1.953815 -0.00495 -0.789379
O  3.454348 -1.550361 0.419423
O  4.374681 0.265029 -0.997035
O  -5.085016 0.405641 -1.789168
O  -6.040089 -0.274599 0.111981
N  -1.374064 -0.082376 -0.462552
N  -2.111122 -0.830978 1.663521
N  -0.268225 0.164355 -1.167389
C  -1.114516 -0.538225 0.821946
C  -3.66441 -0.21917 -0.054382
C  -2.625599 0.074897 -0.898218
C  -3.348243 -0.68751 1.271139
C  0.698858 -0.140172 -0.32823
C  0.257939 -0.585439 0.927785
C  -4.394243 -1.038529 2.281402
C  -5.053511 -0.041713 -0.533726
C  4.236343 -2.041711 1.515452
C  4.72541 1.596285 -1.406859
C  -6.362554 0.639281 -2.389004
C  5.721311 -1.848613 1.306709
C  6.050984 2.001755 -0.807504
C  -6.940326 1.982871 -1.998183
H  -2.73681 0.432733 -1.910555
H  0.832202 -0.874248 1.789047
H  -3.89645 -1.352185 3.195009
H  -5.045364 -0.193634 2.50095
H  -5.039787 -1.843048 1.931796
H  3.985816 -3.099445 1.580697
H  3.910727 -1.557206 2.43918
H  3.945058 2.307454 -1.125028
H  4.771138 1.569728 -2.495623
H  -6.17158 0.599978 -3.460774
H  -7.05044 -0.169163 -2.137636
H  5.996611 -0.794276 1.326824
H  6.050672 -2.276695 0.361014
H  6.265076 -2.344188 2.111135
H  6.333817 2.988364 -1.175559
H  6.840547 1.301688 -1.080366
H  5.986084 2.053513 0.279086
H  -7.179455 2.026084 -0.937146
H  -6.2534 2.794726 -2.236216
H  -7.862724 2.154884 -2.553728
totalener: -1825.68931417 hartree
nucrepener: 2435.50458837 hartree
electener: -4261.19390254 hartree
oneelecener: -7347.05925596 hartree
twoeener: 3085.86535342 hartree
kineticenergy: 1819.76382792 hartree
xcener: -138.295089443019 hartree
chargesum: -0.0000000
charge: -0.377281 0.689400 -0.280708 -0.314837 -0.313343 -0.284657 -0.377957 0.149001 -0.282072 -0.322047 0.137963 -0.146108 0.040914 0.138775 0.282255 -0.223413 -0.231633 0.442727 0.019348 0.032568 0.030468 -0.226312 -0.236974 -0.251726 0.152113 0.117508 0.103559 0.095325 0.096286 0.098766 0.090258 0.085428 0.096591 0.096596 0.089622 0.077811 0.093276 0.085963 0.086541 0.086534 0.085007 0.100664 0.083834 0.083966
qa: -0.3773 0.6894 -0.2807 -0.3148 -0.3133 -0.2847 -0.3780 0.1490 -0.2821 -0.3220 0.1380 -0.1461 0.0409 0.1388 0.2823 -0.2234 -0.2316 0.4427 0.0193 0.0326 0.0305 -0.2263 -0.2370 -0.2517 0.1521 0.1175 0.1036 0.0953 0.0963 0.0988 0.0903 0.0854 0.0966 0.0966 0.0896 0.0778 0.0933 0.0860 0.0865 0.0865 0.0850 0.1007 0.0838 0.0840
va: 2.0391 5.5461 2.2117 2.1200 2.1264 2.1110 2.1240 3.4095 3.1519 2.7924 4.2166 3.7085 4.0498 3.9386 4.1628 3.9779 3.9140 4.1548 3.8910 3.8855 3.8669 3.9077 3.9107 3.9135 1.0319 1.0318 1.0191 1.0077 1.0067 0.9910 1.0111 1.0100 0.9962 0.9947 1.0114 1.0157 1.0068 1.0120 1.0140 1.0026 1.0193 1.0120 1.0056 1.0099
dispcorr: -0.019802791 hartree
energy: -1825.709116959354
dipole: 0.62988 -0.43628 0.19360 3.31282 -3.28988 0.02294 -1.87518 1.02734 -0.84784
magnitude: 0.86996 au
magnitude: 2.21126 debye
