program: Orca
programVersion: 5.0.2
elementType: S P O O O O O N N N C C C C C C C C C C C C C C H H H H H H H H H H H H H H H H H H H H
charge: 0
multiplicity: 1
keywords: wb97x-d3
keywords: def2-TZVPP
keywords: def2/J RIJCOSX
keywords: DEFGRID2
keywords: scfconv7
keywords: smallprint printgap noloewdin
keywords: NOSOSCF
formula: C14H20N3O5PS
InChI: InChI=1/C14H20N3O5PS/c1-5-19-14(18)11-9-17-12(15-10(11)4)8-13(16-17)22-23(24,20-6-2)21-7-3/h8-9H,5-7H2,1-4H3
44 atoms
S  3.266551 1.444529 1.541547
P  3.364609 0.014646 0.279437
O  2.0667 -0.224603 -0.66574
O  3.562526 -1.458383 0.852557
O  4.48814 0.108246 -0.84268
O  -4.894162 0.906438 -1.64517
O  -5.93677 0.030938 0.127213
N  -1.257644 -0.020413 -0.35197
N  -2.08732 -0.977411 1.652237
N  -0.126258 0.218651 -1.016698
C  -1.05557 -0.656081 0.86467
C  -3.558965 -0.038667 0.011354
C  -2.485874 0.284613 -0.775921
C  -3.302965 -0.695937 1.268239
C  0.799365 -0.27582 -0.222929
C  0.307085 -0.833399 0.966204
C  -4.391776 -1.098936 2.211829
C  -4.922592 0.286369 -0.464668
C  4.349964 -1.711811 2.023251
C  4.935318 1.364309 -1.370932
C  -6.14082 1.260811 -2.251516
C  5.82866 -1.490971 1.796498
C  3.904377 2.031247 -2.253736
C  -6.758595 0.101119 -3.003118
H  -2.550884 0.773971 -1.735874
H  0.845256 -1.300333 1.770751
H  -5.081303 -1.806368 1.753343
H  -3.936277 -1.559861 3.084147
H  -4.989607 -0.245906 2.529125
H  4.146478 -2.752394 2.272414
H  3.988578 -1.087909 2.844311
H  5.8331 1.120164 -1.93729
H  5.221794 2.021838 -0.546443
H  -6.82866 1.650037 -1.49971
H  -5.89122 2.072292 -2.934085
H  6.380411 -1.821276 2.676885
H  6.058987 -0.437069 1.642433
H  6.190218 -2.05626 0.938608
H  3.036255 2.361427 -1.684036
H  3.564768 1.364897 -3.045393
H  4.347527 2.91236 -2.718707
H  -7.65037 0.444415 -3.528354
H  -6.070159 -0.301297 -3.745985
H  -7.057825 -0.701675 -2.331632
totalener: -1825.68975352 hartree
nucrepener: 2449.32464466 hartree
electener: -4275.01439818 hartree
oneelecener: -7374.76001615 hartree
twoeener: 3099.74561797 hartree
kineticenergy: 1819.76483190 hartree
xcener: -138.294887278843 hartree
chargesum: 0.0000000
charge: -0.370310 0.686620 -0.287401 -0.324535 -0.316696 -0.284878 -0.376915 0.154360 -0.282288 -0.323546 0.170079 -0.148803 0.044459 0.141893 0.273191 -0.252374 -0.232096 0.442702 0.010720 0.019359 0.028909 -0.226837 -0.224990 -0.250551 0.151623 0.129607 0.096107 0.102644 0.096608 0.098525 0.093784 0.095923 0.089362 0.090035 0.097004 0.085647 0.080209 0.092709 0.087868 0.092071 0.082047 0.084792 0.083287 0.100076
qa: -0.3703 0.6866 -0.2874 -0.3245 -0.3167 -0.2849 -0.3769 0.1544 -0.2823 -0.3235 0.1701 -0.1488 0.0445 0.1419 0.2732 -0.2524 -0.2321 0.4427 0.0107 0.0194 0.0289 -0.2268 -0.2250 -0.2506 0.1516 0.1296 0.0961 0.1026 0.0966 0.0985 0.0938 0.0959 0.0894 0.0900 0.0970 0.0856 0.0802 0.0927 0.0879 0.0921 0.0820 0.0848 0.0833 0.1001
va: 2.0534 5.5331 2.1841 2.1201 2.1252 2.1108 2.1252 3.4025 3.1508 2.7820 4.1477 3.7120 4.0464 3.9344 4.1620 3.9780 3.9149 4.1556 3.8900 3.8798 3.8669 3.9071 3.8972 3.9143 1.0322 1.0189 1.0071 1.0192 1.0071 0.9904 1.0109 0.9913 1.0138 1.0117 0.9947 1.0108 1.0196 1.0066 1.0201 1.0079 1.0101 1.0099 1.0058 1.0116
dispcorr: -0.020002849 hartree
energy: -1825.709756372120
dipole: -3.46972 3.59359 0.12387 0.12836 -0.12739 0.00098 -6.45447 5.60656 -0.84790
magnitude: 0.85691 au
magnitude: 2.17808 debye
