program: Orca
programVersion: 5.0.2
elementType: S O N N C C C C C C C C H H H H H H H H H H H H H H H H H H
charge: 0
multiplicity: 1
keywords: wb97x-d3
keywords: def2-TZVPP
keywords: def2/J RIJCOSX
keywords: DEFGRID2
keywords: scfconv7
keywords: smallprint printgap noloewdin
keywords: NOSOSCF
formula: C8H18N2OS
InChI: InChI=1/C8H18N2OS/c1-4-12-8(11)9-6-5-7-10(2)3/h9H,4-7H2,1-3H3
30 atoms
S  -2.466885 -0.472302 1.190578
O  -1.434219 -1.043457 -1.186182
N  3.21787 1.365488 0.095075
N  -0.121312 -1.458903 0.613906
C  1.868391 -0.657562 -0.662599
C  2.469517 0.175282 0.470017
C  1.060414 -1.839115 -0.141388
C  4.368133 1.05813 -0.729663
C  2.383039 2.363432 -0.541671
C  -1.241553 -1.030808 0.017432
C  -3.754265 0.166107 0.083263
C  -3.442257 1.535705 -0.48449
H  1.236111 -0.043584 -1.308808
H  2.662651 -1.060943 -1.295862
H  3.131653 -0.468412 1.057973
H  1.673954 0.492799 1.149919
H  1.673516 -2.451805 0.519699
H  0.758285 -2.483479 -0.966439
H  4.120947 0.691754 -1.735338
H  4.986861 0.301673 -0.244351
H  4.98341 1.950614 -0.8563
H  2.021119 2.08385 -1.540701
H  2.937638 3.296873 -0.652343
H  1.510468 2.574197 0.078399
H  -0.004255 -1.297712 1.603121
H  -3.939043 -0.569281 -0.698466
H  -4.649869 0.200065 0.703783
H  -3.307076 2.271036 0.3078
H  -2.542077 1.525725 -1.097199
H  -4.269085 1.869875 -1.113308
elementType: S O N C H
totalener: -898.70455021 hartree
nucrepener: 843.32368572 hartree
electener: -1742.02823593 hartree
oneelecener: -2903.16454627 hartree
twoeener: 1161.13631033 hartree
cpcmener: -0.02580561 hartree
kineticenergy: 895.66309097 hartree
xcener: -68.688320971795 hartree
chargesum: -0.0000000
charge: -0.118909 -0.540789 -0.249286 -0.194845 -0.115854 -0.080926 -0.058375 -0.208321 -0.206273 0.335332 -0.072051 -0.259439 0.074216 0.084720 0.090287 0.084957 0.109270 0.106774 0.080933 0.101113 0.101997 0.079584 0.101578 0.099663 0.175016 0.095575 0.115527 0.085370 0.087064 0.096093
qa: -0.1189 -0.5408 -0.2493 -0.1948 -0.1159 -0.0809 -0.0584 -0.2083 -0.2063 0.3353 -0.0721 -0.2594 0.0742 0.0847 0.0903 0.0850 0.1093 0.1068 0.0809 0.1011 0.1020 0.0796 0.1016 0.0997 0.1750 0.0956 0.1155 0.0854 0.0871 0.0961
va: 2.3272 1.9539 2.8923 3.1954 3.7768 3.9005 3.9066 3.9431 3.9449 4.2877 3.8923 3.9315 1.0214 1.0132 1.0024 1.0141 1.0017 1.0125 0.9921 0.9935 0.9942 0.9936 0.9946 0.9951 1.0079 1.0283 1.0055 1.0068 1.0121 1.0041
dispcorr: -0.011240931 hartree
energy: -898.715791144171
dipole: 12.33786 -11.84420 0.49366 8.59057 -8.63937 -0.04880 -5.67980 6.38469 0.70489
magnitude: 0.86195 au
magnitude: 2.19089 debye
