program: Orca
programVersion: 5.0.2
elementType: S O N N C C C C C C C C H H H H H H H H H H H H H H H H H H
charge: 0
multiplicity: 1
keywords: wb97x-d3
keywords: def2-TZVPP
keywords: def2/J RIJCOSX
keywords: DEFGRID2
keywords: scfconv7
keywords: smallprint printgap noloewdin
keywords: NOSOSCF
formula: C8H18N2OS
InChI: InChI=1/C8H18N2OS/c1-4-12-8(11)9-6-5-7-10(2)3/h9H,4-7H2,1-3H3
30 atoms
S  -2.467383 -0.419584 1.203114
O  -1.48167 -1.069892 -1.173079
N  3.298859 1.344311 0.103693
N  -0.12293 -1.398115 0.611024
C  1.87048 -0.619266 -0.670618
C  2.489378 0.191932 0.468191
C  1.04716 -1.792226 -0.154532
C  4.459536 0.979606 -0.682156
C  2.528439 2.370094 -0.568643
C  -1.262186 -1.00902 0.024766
C  -3.808808 0.111978 0.103533
C  -3.57798 1.471074 -0.52455
H  1.243559 0.010885 -1.306918
H  2.655084 -1.029321 -1.311701
H  3.110387 -0.478368 1.071166
H  1.696349 0.548486 1.131412
H  1.655753 -2.420734 0.495966
H  0.727453 -2.424469 -0.981983
H  4.228418 0.61802 -1.693419
H  5.027438 0.198927 -0.17361
H  5.118873 1.842249 -0.793495
H  3.12476 3.278974 -0.667281
H  1.644543 2.622703 0.01892
H  2.189705 2.096648 -1.577452
H  0.010875 -1.206969 1.592717
H  -3.974015 -0.66238 -0.64497
H  -4.69198 0.126358 0.742399
H  -4.433637 1.738344 -1.146785
H  -3.463793 2.243902 0.234714
H  -2.691143 1.480647 -1.156545
elementType: S O N C H
totalener: -898.70466403 hartree
nucrepener: 840.24671001 hartree
electener: -1738.95137404 hartree
oneelecener: -2896.98814316 hartree
twoeener: 1158.03676912 hartree
cpcmener: -0.02584200 hartree
kineticenergy: 895.66341892 hartree
xcener: -68.688395969589 hartree
chargesum: -0.0000000
charge: -0.119040 -0.542318 -0.248807 -0.193585 -0.112475 -0.081731 -0.058848 -0.208613 -0.207309 0.335549 -0.071683 -0.259679 0.074279 0.083959 0.090471 0.085246 0.109971 0.105146 0.080868 0.100676 0.102077 0.101564 0.100329 0.079802 0.174480 0.095633 0.115263 0.096104 0.085425 0.087248
qa: -0.1190 -0.5423 -0.2488 -0.1936 -0.1125 -0.0817 -0.0588 -0.2086 -0.2073 0.3355 -0.0717 -0.2597 0.0743 0.0840 0.0905 0.0852 0.1100 0.1051 0.0809 0.1007 0.1021 0.1016 0.1003 0.0798 0.1745 0.0956 0.1153 0.0961 0.0854 0.0872
va: 2.3270 1.9518 2.8933 3.1980 3.7833 3.9028 3.9056 3.9437 3.9444 4.2887 3.8903 3.9323 1.0195 1.0136 1.0021 1.0138 1.0017 1.0146 0.9922 0.9938 0.9941 0.9945 0.9947 0.9933 1.0080 1.0286 1.0056 1.0041 1.0066 1.0119
dispcorr: -0.011107023 hartree
energy: -898.715771054161
dipole: 12.43504 -11.92701 0.50803 8.24455 -8.27171 -0.02716 -5.79202 6.47829 0.68628
magnitude: 0.85429 au
magnitude: 2.17142 debye
