program: Gaussian 09
title: 000066003
version: EM64L-G09RevD.01
frameworkgroup: C1[X(C21H24F2N2O3)]
method: RPBEPBE
basis: SDD
operation: Freq
keyword: #p
keyword: freq=noraman
keyword: PBEPBE/SDD
title: #p freq=noraman PBEPBE/SDD
converged: YES YES NO NO
title: Mulliken charges:
elementType: F F O O O N N C C C C C C C C C C C C C C C C C C C C C H H H H H H H H H H H H H H H H H H H H H H H H
charge: -0.206044 -0.207155 -0.255437 -0.428200 -0.196793 -0.141615 -0.084572 -0.376876 -0.365123 -0.385057 -0.393110 -0.326138 -0.349917 0.480444 0.460185 -0.271691 -0.427635 -0.409332 -0.311055 -0.329735 -0.368015 -0.369611 -0.384096 -0.389484 0.316020 0.317235 -0.292007 0.169387 0.195855 0.231551 0.192784 0.230927 0.199448 0.192502 0.187555 0.211559 0.204624 0.223400 0.205239 0.195755 0.208194 0.234636 0.233123 0.250498 0.266581 0.254607 0.253839 0.255392 0.254885 0.229714 0.227660 0.385098
chargesum: 0.00000
title: Mulliken charges with hydrogens summed into heavy atoms:
elementType: F F O O O N N C C C C C C C C C C C C C C C C C C C C C
charge: -0.206044 -0.207155 -0.255437 -0.043102 -0.196793 -0.141615 -0.084572 0.050530 0.058588 0.006894 0.006003 -0.121514 0.078722 0.480444 0.460185 0.132258 -0.192999 -0.176209 -0.060557 -0.063154 -0.113408 -0.115772 -0.128704 -0.134599 0.316020 0.317235 0.165366 0.169387
polarizability: 2.81601028e+02 8.30402863e+00 2.49771157e+02 -1.00549276e+01 2.29870408e+00 2.13339091e+02
1716.lowfreq: -9.9089 -2.7393 -0.0012 -0.0008 -0.0005 2.4804 6.5853 15.5419 17.1464
frequency: -9.1297 15.4882 16.9650 21.6600 33.5865 45.4833 52.0006 60.5112 65.3435 76.8473 92.7264 98.2622 119.0136 141.0892 151.9033 176.9632 188.7480 217.7258 238.5415 241.9744 273.4045 290.0302 326.3567 329.5661 342.2607 369.0322 379.4458 396.5385 408.1071 411.4751 416.2540 432.3187 444.2628 477.2473 497.4382 499.3682 500.4134 535.2900 553.5882 570.9690 596.8136 618.6129 625.5583 626.1499 645.5516 709.8955 717.2593 765.9284 770.1953 775.4755 808.3541 815.5047 816.5130 820.8731 823.7594 830.1741 848.7650 855.8812 862.2914 865.3423 936.3223 940.7349 948.7061 953.6080 957.5078 983.0240 1000.8250 1002.4083 1004.7242 1007.6236 1022.1533 1032.2612 1053.8629 1077.9935 1081.5829 1096.1962 1097.6116 1103.0126 1111.0050 1123.3167 1140.3542 1147.7744 1151.6880 1155.6481 1162.8992 1180.5415 1186.6869 1194.5329 1197.3052 1198.7892 1206.1146 1219.8722 1251.0546 1256.4988 1271.2723 1272.3525 1285.7451 1292.8402 1302.7071 1308.8210 1314.6113 1320.2449 1341.1835 1353.7427 1368.8367 1377.7807 1386.2654 1386.5916 1394.7530 1405.6657 1408.6134 1410.8324 1448.2817 1453.6048 1459.2463 1464.5079 1472.6240 1476.0235 1486.7876 1486.8193 1492.1258 1601.9240 1603.9159 1608.1365 1611.0248 1702.0922 2827.6685 2854.3750 2863.0434 2874.2537 2882.6867 2901.8123 2925.7008 2936.4172 2969.2871 2992.0269 3032.7168 3038.7564 3052.0135 3063.2406 3067.6454 3127.3660 3129.5888 3143.3320 3150.4977 3171.5150 3172.8989 3174.7175 3175.7995 3524.1274
redmass: 3.8376 8.6174 6.0240 7.2398 9.4388 5.1814 3.6932 3.2848 4.3933 3.1111 5.2191 6.1145 2.3622 6.7273 5.2579 7.0242 5.5080 3.9822 4.0938 3.3915 4.0474 3.2412 3.2043 6.6367 2.9940 5.7007 5.1945 4.8575 2.5445 2.7883 3.0227 3.2034 4.8660 3.1500 4.1174 3.3080 1.7952 4.5599 3.0947 5.1759 5.3341 4.0724 1.4589 7.1898 2.6237 3.9482 4.2382 4.7503 3.6518 3.9330 1.4748 1.3744 2.0816 1.6995 2.0408 1.7913 1.5686 3.1244 2.1972 3.7543 5.1766 1.4259 1.3961 2.0658 1.3871 1.3245 1.9345 2.7154 2.7607 2.5819 2.9367 3.1401 1.7408 2.0259 2.5740 1.3347 1.8237 3.6130 1.9086 2.2765 3.0778 2.8550 1.3759 1.4623 1.7283 2.0254 1.7783 1.1266 1.3122 2.8160 2.6405 1.4634 1.5598 1.5600 1.3046 1.3622 1.2764 1.3088 1.4465 1.2371 1.4545 1.3583 1.2782 1.4138 1.5042 2.3415 4.5197 1.5707 2.6552 2.7666 2.5219 1.5409 1.0874 1.0805 1.0783 1.0911 1.0928 1.0993 2.4830 1.1123 2.6699 7.5294 7.7066 6.5308 6.5086 9.2242 1.0810 1.0710 1.0700 1.0709 1.0694 1.0695 1.0555 1.0557 1.1018 1.1036 1.0892 1.0894 1.0926 1.0874 1.0889 1.0899 1.0900 1.0891 1.0884 1.0955 1.0957 1.0958 1.0963 1.0642
irintensity: 0.2216 2.2862 0.2152 0.4320 0.2367 0.0329 2.3443 1.6236 0.8601 3.1673 5.3932 2.0263 1.2384 0.4294 1.1860 1.5174 0.4963 0.0307 0.2352 0.9392 1.9514 1.5795 7.5331 0.3900 6.0123 2.7399 4.2517 0.8176 4.5926 0.4274 0.4090 7.3727 5.0346 0.3957 2.0140 1.3240 28.8165 34.6220 56.9528 5.1302 19.8363 0.3053 141.1189 0.4589 1.4073 0.1912 3.9870 10.5154 12.3772 3.0729 2.4315 12.9132 35.6563 41.7526 37.3378 34.6153 0.1906 2.2287 44.0812 3.1743 35.1595 2.2855 0.9168 2.4230 0.4659 7.4272 0.0856 92.5212 15.6959 11.6493 1.6379 467.9335 2.8448 8.6121 3.7888 1.7733 46.9268 25.9754 18.2313 30.3154 41.3505 68.9093 57.7158 18.0157 5.3225 10.5975 21.4586 3.8706 4.6338 47.4707 33.0289 1.7360 20.6243 3.2417 4.6285 15.8735 16.6786 24.4602 5.0824 13.3219 9.3619 6.4128 1.6491 6.5590 8.3744 2.8412 0.3050 0.6126 4.8090 1.9031 4.1499 10.0286 27.4751 1.4960 0.6251 15.5819 9.3683 2.8226 156.2108 8.6082 71.7523 0.4309 10.9985 20.5930 17.6766 217.1895 46.0660 66.4315 25.2486 6.6866 179.0635 95.1365 54.1304 63.6774 36.9060 39.1777 29.0740 43.7136 42.8035 37.8171 15.6305 4.8560 13.9035 3.6951 4.4450 2.6236 5.9970 4.6875 2.4323 28.9815
temp: 298.150 k
press: 1.00000 atm
elementType: 9 9 8 8 8 7 7 6 6 6 6 6 6 6 6 6 6 6 6 6 6 6 6 6 6 6 6 6 1 1 1 1 1 1 1 1 1 1 1 1 1 1 1 1 1 1 1 1 1 1 1 1
symmnumber: 1
zpe: 1085687.6 jmol-1
zpe.correction: 0.413517 hartree
zpe.thermalcorrener: 0.439204 hartree
zpe.thermalcorrenthalpy: 0.440148 hartree
zpe.thermalcorrgfe: 0.353507 hartree
zpe.sumelectzpe: -1347.369053 hartree
zpe.sumelectthermal: -1347.343365 hartree
zpe.sumelectthermalent: -1347.342421 hartree
zpe.sumelectthermalfe: -1347.429062 hartree
dipole: 2.0414 0.7260 3.5695
dipole: 4.1756
quadrupole: -176.4926 -180.0345 -157.0075
quadrupole: 9.3807 5.2291 -1.9857
quadrupole: -5.3144 -8.8563 14.1707 9.3807 5.2291 -1.9857
hfenergy: -1347.7825692 hartree
pointgroup: C01 [X(C21H24F2N2O3)]
dipole: 0.8440514 -0.4066889 -1.3494439 debye
polarizability: 281.7506241|-5.7425047|249.2833188|12.1513944|-1.4434716|213.6773334 unknown
InChI: InChI=1S/C21H24F2N2O3/c22-18-5-1-16(2-6-18)21(17-3-7-19(23)8-4-17)25-11-9-24(10-12-25)13-14-28-15-20(26)27/h1-8,21,26H,9-15H2
charge 0 multiplicity 1
52 atoms
F  -5.759575 4.023035 0.135541
F  -4.292382 -4.977986 1.235671
O  5.992474 0.560439 0.291672
O  9.506541 -0.187609 -0.301559
O  8.506901 1.013323 1.427792
N  -0.583765 0.132568 -0.214354
N  2.286915 0.661676 -0.181827
C  0.411626 -0.927523 -0.538598
C  -0.027424 1.453541 -0.619473
C  1.73571 -0.66369 0.193363
C  1.295009 1.72396 0.11474
C  -1.92035 -0.153892 -0.817762
C  3.619145 0.930626 0.408226
C  -2.915661 0.988999 -0.561328
C  -2.502917 -1.470198 -0.272083
C  4.73239 0.255254 -0.404149
C  -3.678815 1.519043 -1.628853
C  -3.286785 -2.296931 -1.112494
C  -3.120704 1.498656 0.746866
C  -2.324128 -1.844399 1.084107
C  -4.638375 2.534218 -1.409883
C  -3.89443 -3.473606 -0.619714
C  -4.065707 2.516548 0.989275
C  -2.915942 -3.01741 1.597941
C  -4.808391 3.008163 -0.099594
C  -3.694185 -3.803906 0.730626
C  7.138598 0.005266 -0.395519
C  8.400163 0.359874 0.377177
H  0.607255 -0.965366 -1.639427
H  0.012653 -1.908058 -0.229326
H  0.158002 1.489559 -1.722121
H  -0.750095 2.247073 -0.367616
H  2.459672 -1.452873 -0.079757
H  1.556923 -0.731209 1.297139
H  1.085086 1.800293 1.211718
H  1.703341 2.694277 -0.223144
H  -1.829674 -0.264771 -1.930533
H  3.802476 2.020044 0.395945
H  3.695437 0.600087 1.471651
H  4.587344 -0.846308 -0.458793
H  4.745177 0.658585 -1.438905
H  -3.524248 1.140433 -2.646137
H  -3.431225 -2.021127 -2.163934
H  -2.523405 1.102337 1.574088
H  -1.696935 -1.216043 1.72515
H  -5.234735 2.951015 -2.226478
H  -4.503359 -4.120064 -1.258172
H  -4.232641 2.921106 1.991844
H  -2.783724 -3.320346 2.640785
H  7.239821 0.40408 -1.429601
H  7.080873 -1.103315 -0.47759
H  10.339647 0.037552 0.194007
