program: Orca
programVersion: 5.0.2
elementType: S O N N C C C C C C C C H H H H H H H H H H H H H H H H H H
charge: 0
multiplicity: 1
keywords: wb97x-d3
keywords: def2-TZVPP
keywords: def2/J RIJCOSX
keywords: DEFGRID2
keywords: scfconv7
keywords: smallprint printgap noloewdin
keywords: NOSOSCF
formula: C8H18N2OS
InChI: InChI=1/C8H18N2OS/c1-4-12-8(11)9-6-5-7-10(2)3/h9H,4-7H2,1-3H3
30 atoms
S  -2.144998 -0.521333 -1.078423
O  -1.022258 -0.410843 1.321351
N  2.0292 0.953988 0.465445
N  0.044176 -1.666701 -0.246929
C  2.493953 -1.377462 -0.262765
C  2.366546 0.090734 -0.648328
C  1.275601 -1.925701 0.472874
C  1.486646 2.217408 0.024388
C  3.137034 1.148191 1.370774
C  -0.930612 -0.86054 0.196919
C  -3.296021 0.559327 -0.185185
C  -2.825004 1.994419 -0.06786
H  2.664161 -1.952414 -1.178036
H  3.372855 -1.551761 0.363247
H  1.574808 0.184506 -1.396163
H  3.294487 0.410177 -1.153394
H  1.19169 -1.483948 1.46223
H  1.388128 -3.002604 0.615723
H  1.159472 2.80657 0.883467
H  0.61469 2.052948 -0.611847
H  2.20137 2.833979 -0.544573
H  3.99102 1.671081 0.909107
H  3.504151 0.194417 1.752441
H  2.818324 1.736434 2.233455
H  0.011485 -1.975783 -1.207945
H  -4.220997 0.503811 -0.761103
H  -3.505011 0.117866 0.789055
H  -1.907297 2.073528 0.513395
H  -2.647212 2.436012 -1.048244
H  -3.587815 2.593171 0.433854
elementType: S O N C H
totalener: -898.70704208 hartree
nucrepener: 879.26586636 hartree
electener: -1777.97290845 hartree
oneelecener: -2975.62592490 hartree
twoeener: 1197.65301646 hartree
cpcmener: -0.02213858 hartree
kineticenergy: 895.65514074 hartree
xcener: -68.685619658554 hartree
chargesum: 0.0000000
charge: -0.127493 -0.499380 -0.238956 -0.177287 -0.128611 -0.082654 -0.029251 -0.193240 -0.191629 0.299157 -0.070203 -0.262209 0.084163 0.076305 0.079761 0.087134 0.089779 0.108066 0.102747 0.083256 0.085348 0.073804 0.096661 0.099454 0.157801 0.113413 0.096330 0.081981 0.085311 0.100440
qa: -0.1275 -0.4994 -0.2390 -0.1773 -0.1286 -0.0827 -0.0293 -0.1932 -0.1916 0.2992 -0.0702 -0.2622 0.0842 0.0763 0.0798 0.0871 0.0898 0.1081 0.1027 0.0833 0.0853 0.0738 0.0967 0.0995 0.1578 0.1134 0.0963 0.0820 0.0853 0.1004
va: 2.3183 2.0030 2.8538 3.1844 3.8546 3.8847 3.8541 3.9220 3.9433 4.3364 3.8942 3.9282 1.0147 1.0123 1.0105 1.0161 1.0357 1.0035 0.9941 0.9984 1.0045 1.0054 0.9928 0.9960 1.0180 1.0067 1.0282 1.0107 1.0062 1.0060
dispcorr: -0.012993576 hartree
energy: -898.720035660017
dipole: 11.19815 -10.39770 0.80045 9.17798 -9.43988 -0.26191 1.75624 -2.89243 -1.13619
magnitude: 1.41430 au
magnitude: 3.59486 debye
