program: Orca
programVersion: 5.0.2
elementType: S O N N C C C C C C C C H H H H H H H H H H H H H H H H H H
charge: 0
multiplicity: 1
keywords: wb97x-d3
keywords: def2-TZVPP
keywords: def2/J RIJCOSX
keywords: DEFGRID2
keywords: scfconv7
keywords: smallprint printgap noloewdin
keywords: NOSOSCF
formula: C8H18N2OS
InChI: InChI=1/C8H18N2OS/c1-4-12-8(11)9-6-5-7-10(2)3/h9H,4-7H2,1-3H3
30 atoms
S  -2.778985 -1.321561 0.286133
O  -1.171152 0.785406 0.136034
N  3.394997 1.021679 -0.254739
N  -0.326633 -1.185047 -0.59787
C  1.904673 -0.857958 0.422688
C  3.323094 -0.354881 0.20057
C  1.028126 -0.713975 -0.814176
C  4.753671 1.372248 -0.598296
C  2.849275 1.949484 0.711161
C  -1.284439 -0.406759 -0.076773
C  -3.909747 0.025264 0.730227
C  -4.487177 0.750852 -0.467213
H  1.963936 -1.913094 0.703128
H  1.436556 -0.347082 1.268063
H  3.802257 -0.982575 -0.557225
H  3.898727 -0.50344 1.131331
H  1.447341 -1.289841 -1.64065
H  0.989585 0.321811 -1.146091
H  5.128716 0.709549 -1.380668
H  5.454126 1.312269 0.250511
H  4.794085 2.391958 -0.985307
H  2.970122 2.972125 0.350645
H  3.332459 1.887101 1.699908
H  1.779762 1.789097 0.854149
H  -0.491753 -2.176141 -0.68785
H  -4.698923 -0.457721 1.308447
H  -3.392821 0.704265 1.407549
H  -5.0398 0.070854 -1.115177
H  -5.177367 1.527486 -0.131852
H  -3.711242 1.231682 -1.061576
elementType: S O N C H
totalener: -898.70931024 hartree
nucrepener: 831.58762839 hartree
electener: -1730.29693863 hartree
oneelecener: -2880.05190040 hartree
twoeener: 1149.75496177 hartree
cpcmener: -0.01981092 hartree
kineticenergy: 895.66013174 hartree
xcener: -68.684739652381 hartree
chargesum: -0.0000000
charge: -0.124098 -0.512494 -0.243892 -0.195250 -0.124878 -0.095774 -0.024800 -0.191714 -0.186013 0.321271 -0.071130 -0.258149 0.084995 0.081621 0.089751 0.083202 0.106682 0.088643 0.097721 0.071777 0.097878 0.098019 0.079682 0.088572 0.164492 0.112601 0.094929 0.083890 0.094047 0.088420
qa: -0.1241 -0.5125 -0.2439 -0.1953 -0.1249 -0.0958 -0.0248 -0.1917 -0.1860 0.3213 -0.0711 -0.2581 0.0850 0.0816 0.0898 0.0832 0.1067 0.0886 0.0977 0.0718 0.0979 0.0980 0.0797 0.0886 0.1645 0.1126 0.0949 0.0839 0.0940 0.0884
va: 2.3184 1.9912 2.8629 3.2010 3.8404 3.9096 3.8107 3.9348 3.9270 4.2968 3.8939 3.9317 1.0197 1.0113 0.9993 1.0104 1.0052 1.0402 0.9963 1.0008 0.9963 0.9978 1.0045 1.0044 1.0162 1.0053 1.0296 1.0073 1.0041 1.0116
dispcorr: -0.010808514 hartree
energy: -898.720118750204
dipole: 13.67694 -13.17191 0.50502 7.16810 -8.27869 -1.11059 0.15323 -0.16147 -0.00824
magnitude: 1.22006 au
magnitude: 3.10113 debye
