program: Orca
programVersion: 5.0.2
elementType: S O N N C C C C C C C C H H H H H H H H H H H H H H H H H H
charge: 0
multiplicity: 1
keywords: wb97x-d3
keywords: def2-TZVPP
keywords: def2/J RIJCOSX
keywords: DEFGRID2
keywords: scfconv7
keywords: smallprint printgap noloewdin
keywords: NOSOSCF
formula: C8H18N2OS
InChI: InChI=1/C8H18N2OS/c1-4-12-8(11)9-6-5-7-10(2)3/h9H,4-7H2,1-3H3
30 atoms
S  -2.494808 -0.596917 1.094275
O  -1.338171 -0.894946 -1.273043
N  2.964113 1.333983 0.050399
N  -0.159343 -1.610617 0.530337
C  2.216529 -1.036192 0.116973
C  1.964148 0.376723 -0.390421
C  1.059027 -1.988137 -0.159393
C  4.267727 1.080588 -0.522716
C  2.54233 2.685768 -0.241965
C  -1.219646 -1.057635 -0.07459
C  -3.687227 0.221723 0.0001
C  -3.284561 1.623924 -0.407301
H  3.104855 -1.466561 -0.351842
H  2.414196 -1.005547 1.192773
H  1.000155 0.723113 -0.00764
H  1.871603 0.35856 -1.491129
H  1.333974 -2.995384 0.158454
H  0.848596 -2.042179 -1.226566
H  4.640662 0.096848 -0.23715
H  4.985674 1.812647 -0.148893
H  4.27949 1.136566 -1.623395
H  2.433284 2.891095 -1.319056
H  3.265545 3.400032 0.156032
H  1.581427 2.893617 0.232139
H  -0.137903 -1.651252 1.539159
H  -3.865292 -0.418541 -0.862995
H  -4.612849 0.239688 0.577682
H  -2.356551 1.631155 -0.976921
H  -4.062539 2.061335 -1.036129
H  -3.156564 2.269094 0.461644
elementType: S O N C H
totalener: -898.70931789 hartree
nucrepener: 843.02345204 hartree
electener: -1741.73276993 hartree
oneelecener: -2902.66812539 hartree
twoeener: 1160.93535546 hartree
cpcmener: -0.02037463 hartree
kineticenergy: 895.65453316 hartree
xcener: -68.683455668104 hartree
chargesum: -0.0000000
charge: -0.123471 -0.505044 -0.231839 -0.192142 -0.069389 -0.099879 -0.052436 -0.191734 -0.190552 0.311970 -0.073163 -0.258748 0.072639 0.064130 0.082136 0.066520 0.108765 0.099404 0.098990 0.098935 0.075041 0.076075 0.098208 0.096758 0.162887 0.096516 0.113482 0.086906 0.095268 0.083768
qa: -0.1235 -0.5050 -0.2318 -0.1921 -0.0694 -0.0999 -0.0524 -0.1917 -0.1906 0.3120 -0.0732 -0.2587 0.0726 0.0641 0.0821 0.0665 0.1088 0.0994 0.0990 0.0989 0.0750 0.0761 0.0982 0.0968 0.1629 0.0965 0.1135 0.0869 0.0953 0.0838
va: 2.3198 1.9988 2.9158 3.1844 3.7832 3.9464 3.8855 3.9279 3.9350 4.3168 3.8978 3.9291 1.0186 1.0299 1.0011 1.0111 1.0017 1.0226 0.9946 0.9949 1.0039 1.0021 0.9946 0.9971 1.0155 1.0277 1.0060 1.0135 1.0045 1.0073
dispcorr: -0.010979773 hartree
energy: -898.720297659535
dipole: 12.98207 -12.44130 0.54076 9.71428 -9.81250 -0.09822 -4.49804 5.17606 0.67802
magnitude: 0.87280 au
magnitude: 2.21849 debye
