program: Orca
programVersion: 5.0.2
elementType: S O N N C C C C C C C C H H H H H H H H H H H H H H H H H H
charge: 0
multiplicity: 1
keywords: wb97x-d3
keywords: def2-TZVPP
keywords: def2/J RIJCOSX
keywords: DEFGRID2
keywords: scfconv7
keywords: smallprint printgap noloewdin
keywords: NOSOSCF
formula: C8H18N2OS
InChI: InChI=1/C8H18N2OS/c1-4-12-8(11)9-6-5-7-10(2)3/h9H,4-7H2,1-3H3
30 atoms
S  -1.816188 0.769202 0.78677
O  -1.78462 -1.780132 0.037275
N  2.417247 0.830919 -0.016423
N  0.210843 -0.837703 0.595716
C  2.092118 -1.517895 -0.840011
C  3.058507 -0.423876 -0.398017
C  1.091832 -1.931203 0.232821
C  3.342173 1.689049 0.694472
C  1.851491 1.52606 -1.156444
C  -1.109804 -0.834842 0.400264
C  -3.542622 0.526849 0.288813
C  -3.769174 0.634646 -1.205161
H  1.559162 -1.2369 -1.751869
H  2.690892 -2.394916 -1.098857
H  3.807061 -0.260436 -1.190826
H  3.609887 -0.790328 0.472711
H  1.628119 -2.267923 1.124928
H  0.49293 -2.772253 -0.112281
H  3.705939 1.189267 1.593504
H  2.837349 2.604696 1.00611
H  4.217148 1.978269 0.092893
H  2.608381 1.804901 -1.905006
H  1.356999 2.439822 -0.824241
H  1.097763 0.917383 -1.656192
H  0.705367 0.03944 0.751554
H  -3.88947 -0.427221 0.68467
H  -4.091183 1.306702 0.81927
H  -3.223801 -0.132946 -1.752697
H  -4.830592 0.51107 -1.428993
H  -3.459923 1.608376 -1.584767
elementType: S O N C H
totalener: -898.70949441 hartree
nucrepener: 865.70418163 hartree
electener: -1764.41367604 hartree
oneelecener: -2948.07639917 hartree
twoeener: 1183.66272313 hartree
cpcmener: -0.01739097 hartree
kineticenergy: 895.66480214 hartree
xcener: -68.688379928603 hartree
chargesum: 0.0000000
charge: -0.135448 -0.517213 -0.239638 -0.207140 -0.137546 -0.075379 -0.027320 -0.187715 -0.210770 0.313784 -0.069600 -0.258247 0.080507 0.083442 0.081315 0.091826 0.097722 0.094403 0.099802 0.100291 0.083806 0.091870 0.106314 0.098684 0.174540 0.092840 0.111205 0.086872 0.093730 0.083061
qa: -0.1354 -0.5172 -0.2396 -0.2071 -0.1375 -0.0754 -0.0273 -0.1877 -0.2108 0.3138 -0.0696 -0.2582 0.0805 0.0834 0.0813 0.0918 0.0977 0.0944 0.0998 0.1003 0.0838 0.0919 0.1063 0.0987 0.1745 0.0928 0.1112 0.0869 0.0937 0.0831
va: 2.3062 1.9940 2.9172 3.1367 3.9087 3.8814 3.8553 3.9084 3.9143 4.3157 3.8952 3.9289 1.0090 1.0177 1.0137 0.9998 1.0007 1.0316 0.9975 0.9963 1.0018 1.0095 0.9976 0.9986 1.0689 1.0297 1.0063 1.0135 1.0047 1.0073
dispcorr: -0.012026199 hartree
energy: -898.721520607101
dipole: 10.44661 -8.85292 1.59369 4.14593 -3.25316 0.89277 -6.65390 6.33678 -0.31713
magnitude: 1.85404 au
magnitude: 4.71258 debye
