program: Orca
programVersion: 5.0.2
elementType: S O N N C C C C C C C C H H H H H H H H H H H H H H H H H H
charge: 0
multiplicity: 1
keywords: wb97x-d3
keywords: def2-TZVPP
keywords: def2/J RIJCOSX
keywords: DEFGRID2
keywords: scfconv7
keywords: smallprint printgap noloewdin
keywords: NOSOSCF
formula: C8H18N2OS
InChI: InChI=1/C8H18N2OS/c1-4-12-8(11)9-6-5-7-10(2)3/h9H,4-7H2,1-3H3
30 atoms
S  -2.213045 0.438241 -1.093979
O  -1.584699 -1.710484 0.33357
N  2.75248 0.8202 -0.01619
N  0.09166 -0.763082 -0.860895
C  1.683857 -1.185155 1.004901
C  1.978755 0.306216 1.099279
C  1.15568 -1.611278 -0.360991
C  2.789849 2.265404 0.002608
C  4.091601 0.2752 -0.054264
C  -1.168922 -0.849281 -0.418152
C  -3.756444 0.140945 -0.189872
C  -3.734542 0.64622 1.238414
H  2.573533 -1.780991 1.22467
H  0.957575 -1.434451 1.78211
H  2.467401 0.512417 2.067462
H  1.029142 0.848406 1.121999
H  0.806853 -2.643519 -0.32486
H  1.952466 -1.579279 -1.10272
H  1.776315 2.669783 -0.031765
H  3.322723 2.640323 -0.873459
H  3.285331 2.681421 0.894541
H  4.68508 0.513503 0.843446
H  4.629052 0.670314 -0.91841
H  4.073749 -0.810317 -0.157686
H  0.381589 0.061694 -1.365113
H  -4.515524 0.665071 -0.773478
H  -3.995159 -0.921175 -0.244274
H  -3.541948 1.718457 1.277548
H  -4.702394 0.462668 1.709168
H  -2.976116 0.1420 1.835931
elementType: S O N C H
totalener: -898.70880800 hartree
nucrepener: 857.88906056 hartree
electener: -1756.59786856 hartree
oneelecener: -2932.35565120 hartree
twoeener: 1175.75778264 hartree
cpcmener: -0.01728444 hartree
kineticenergy: 895.65756321 hartree
xcener: -68.685038353667 hartree
chargesum: -0.0000000
charge: -0.125115 -0.507400 -0.247347 -0.183078 -0.117769 -0.104209 -0.071561 -0.186394 -0.190634 0.317928 -0.072280 -0.260736 0.083622 0.085760 0.091228 0.092787 0.106158 0.107933 0.094571 0.098365 0.076745 0.078745 0.100122 0.093004 0.162935 0.113257 0.095907 0.084193 0.094577 0.088685
qa: -0.1251 -0.5074 -0.2473 -0.1831 -0.1178 -0.1042 -0.0716 -0.1864 -0.1906 0.3179 -0.0723 -0.2607 0.0836 0.0858 0.0912 0.0928 0.1062 0.1079 0.0946 0.0984 0.0767 0.0787 0.1001 0.0930 0.1629 0.1133 0.0959 0.0842 0.0946 0.0887
va: 2.3188 1.9984 2.8623 3.1611 3.7579 3.8981 3.9103 3.9211 3.9376 4.3176 3.8958 3.9289 1.0108 1.0230 1.0145 1.0037 1.0159 1.0049 0.9973 0.9964 1.0027 1.0045 0.9962 0.9958 1.0280 1.0057 1.0285 1.0072 1.0041 1.0133
dispcorr: -0.011853834 hartree
energy: -898.720661834136
dipole: 12.18958 -11.16066 1.02892 4.83359 -3.92753 0.90606 7.19727 -7.26500 -0.06773
magnitude: 1.37267 au
magnitude: 3.48905 debye
