program: Gaussian 09
title: 000065899
version: EM64L-G09RevD.01
frameworkgroup: C1[X(C15H21NO2)]
method: RPBEPBE
basis: SDD
operation: Freq
keyword: #p
keyword: freq=noraman
keyword: PBEPBE/SDD
title: #p freq=noraman PBEPBE/SDD
converged: YES YES NO NO
title: Mulliken charges:
elementType: O O N C C C C C C C C C C C C C C C H H H H H H H H H H H H H H H H H H H H H
charge: -0.245000 -0.440528 -0.107792 -0.062878 -0.148366 -0.464442 -0.415675 -0.378903 -0.411159 0.357960 -0.305899 0.107396 -0.400449 -0.559692 -0.355082 0.268094 -0.694635 -0.356575 0.207884 0.237055 0.208339 0.216213 0.198650 0.207226 0.173885 0.221033 0.228940 0.212896 0.201417 0.173826 0.206653 0.215632 0.209387 0.250800 0.210891 0.209979 0.221595 0.252628 0.348698
chargesum: 0.00000
title: Mulliken charges with hydrogens summed into heavy atoms:
elementType: O O N C C C C C C C C C C C C C C C
charge: -0.245000 -0.091829 -0.107792 0.145005 0.088688 -0.039890 -0.009799 0.016015 0.030678 0.357960 0.069344 0.107396 0.021837 -0.350305 -0.104283 0.268094 -0.052170 -0.103948
polarizability: 2.38019272e+02 4.29763492e+00 1.73871241e+02 3.24879882e+00 -5.27130599e+00 1.08419195e+02
1716.lowfreq: -10.4063 -5.0705 0.0005 0.0007 0.0009 7.7486 23.9789 65.1481 70.3925
frequency: 23.8510 64.9791 70.3863 89.7941 98.8326 131.0790 157.7143 182.4627 197.9714 230.6337 250.0013 266.5371 301.7614 312.1050 319.3543 349.0615 357.5433 372.6260 408.9106 419.7030 454.6528 457.3098 466.8547 521.9712 544.1950 562.2555 603.3580 651.7121 710.6683 717.7585 757.6821 766.4711 793.7793 820.7505 825.2769 842.3248 881.8830 887.5769 912.7152 922.3257 932.9264 944.0843 964.8729 979.3756 995.8087 1038.2779 1056.8531 1071.5482 1090.1895 1094.0767 1110.1960 1123.1700 1133.0042 1137.7221 1140.6955 1164.0720 1179.2585 1187.4640 1198.2226 1208.3835 1234.6430 1250.8518 1258.3299 1260.2379 1271.4897 1293.2726 1298.5446 1304.1375 1311.7944 1316.9547 1337.0703 1340.2780 1356.4438 1368.5630 1380.1837 1384.6242 1392.8442 1398.3128 1427.4587 1457.8916 1464.2230 1464.3381 1471.9186 1473.7162 1478.7716 1479.8732 1489.6892 1490.4418 1608.2017 1621.6727 2822.9263 2827.7168 2842.0574 2949.1282 2975.2069 2978.5804 2981.5026 2987.7360 2988.5163 3031.3774 3040.8475 3047.9436 3052.7376 3063.7170 3074.4174 3078.2157 3108.7443 3114.3625 3156.6888 3179.5770 3585.4972
redmass: 4.8650 1.8916 2.4274 3.2922 3.3415 2.8556 3.6734 3.7158 3.8031 1.1682 3.1398 2.7953 2.6514 1.1306 2.7345 2.9197 4.9933 3.6027 3.9594 4.5918 4.0556 2.9777 4.7410 2.3940 3.6393 3.0936 3.8810 5.1643 3.8209 5.3994 1.1472 3.4595 2.4521 1.5153 2.1097 1.5843 1.3206 1.7301 1.9567 2.0311 2.6598 1.3432 2.6022 3.5629 2.0497 2.8439 2.1849 2.7102 2.3064 2.2947 2.3206 1.6744 2.1324 1.7866 1.7399 1.8582 1.7355 2.0079 1.9572 1.3213 1.3665 1.2824 1.8839 1.3095 1.2791 1.3925 1.7300 1.2221 1.2739 1.3488 1.4680 1.5271 1.4456 1.3943 1.5271 1.9261 1.5744 1.5691 3.3740 1.0870 1.0993 1.0861 1.0940 1.1180 1.0554 1.0467 1.0973 2.6804 7.1732 6.9623 1.0746 1.0752 1.0717 1.0806 1.0356 1.0613 1.0672 1.0613 1.0605 1.0916 1.0988 1.0957 1.1019 1.0887 1.1005 1.0994 1.0956 1.0900 1.0882 1.0973 1.0660
irintensity: 0.2352 0.2674 0.5946 0.5813 1.0676 0.5866 0.3662 6.2962 0.5221 0.1429 0.9305 1.0693 1.3872 136.4365 1.8521 7.0969 3.6088 0.6446 5.0496 1.6012 10.8253 18.1210 5.9457 1.7042 0.8719 1.5642 5.1631 2.0963 5.2114 32.8072 5.9153 3.8563 1.9526 25.2643 18.0957 25.9007 2.5368 9.3296 1.3059 10.5031 4.8329 0.4477 21.4596 51.5408 28.4904 7.6918 5.2011 15.0479 46.8029 22.2608 7.1601 142.3460 10.4910 41.4367 33.3933 22.1902 75.5209 28.4621 51.6016 1.3365 6.1784 2.4879 8.4071 1.8722 4.6923 3.7985 2.7622 4.9819 1.6341 3.2619 9.5500 6.5996 0.3677 0.7753 5.7819 2.7930 18.2979 6.7973 125.1025 11.1294 1.1214 3.9111 5.6409 0.1840 8.9705 8.7141 11.1496 147.2985 2.2809 17.0659 36.1932 32.0869 171.9955 8.5192 44.0046 10.1405 85.1220 56.6572 1.1225 7.7144 35.2446 8.4218 60.7288 45.3232 64.6395 72.1853 31.0525 18.7000 4.2291 7.8007 30.8828
temp: 298.150 k
press: 1.00000 atm
elementType: 8 8 7 6 6 6 6 6 6 6 6 6 6 6 6 6 6 6 1 1 1 1 1 1 1 1 1 1 1 1 1 1 1 1 1 1 1 1 1
symmnumber: 1
zpe: 873461.1 jmol-1
zpe.correction: 0.332684 hartree
zpe.thermalcorrener: 0.349631 hartree
zpe.thermalcorrenthalpy: 0.350576 hartree
zpe.thermalcorrgfe: 0.288143 hartree
zpe.sumelectzpe: -787.998622 hartree
zpe.sumelectthermal: -787.981674 hartree
zpe.sumelectthermalent: -787.980730 hartree
zpe.sumelectthermalfe: -788.043163 hartree
dipole: -2.9298 2.5987 -0.0892
dipole: 3.9172
quadrupole: -112.6527 -101.8085 -111.3104
quadrupole: 6.6085 -2.6092 -0.2062
quadrupole: -4.0622 6.7820 -2.7198 6.6085 -2.6092 -0.2062
hfenergy: -788.3313056 hartree
pointgroup: C01 [X(C15H21N1O2)]
dipole: 1.1789624 0.991756 0.0402156 debye
polarizability: 237.79117|-5.9525412|173.9938658|2.4921608|6.0551014|108.5246715 unknown
InChI: InChI=1S/C15H21NO2/c1-2-7-16-8-3-4-12-13-9-11(17)5-6-15(13)18-10-14(12)16/h5-6,9,12,14,17H,2-4,7-8,10H2,1H3
charge 0 multiplicity 1
39 atoms
O  -0.558484 -2.131592 -0.173414
O  -5.126254 1.136897 0.154639
N  2.361928 0.309915 0.136243
C  1.001693 -0.200672 -0.216017
C  -0.086088 0.748509 0.366907
C  0.081123 2.16761 -0.225376
C  1.512488 2.672105 0.046365
C  2.56183 1.663996 -0.454251
C  0.73272 -1.62036 0.324762
C  -1.48344 0.151063 0.173194
C  3.461244 -0.621331 -0.255387
C  -1.64666 -1.236476 -0.078683
C  4.865609 -0.157053 0.190414
C  -2.656002 0.94474 0.257031
C  -2.927598 -1.803672 -0.271263
C  -3.93679 0.378971 0.077029
C  5.906681 -1.287705 0.035832
C  -4.078542 -1.000564 -0.196671
H  0.869085 -0.243936 -1.331151
H  0.125925 0.819331 1.456209
H  -0.650162 2.869859 0.215628
H  -0.116754 2.134631 -1.315951
H  1.681295 3.647318 -0.449296
H  1.652264 2.821464 1.134629
H  2.520455 1.613355 -1.575456
H  3.566891 2.022078 -0.17722
H  1.45397 -2.367403 -0.036339
H  0.729883 -1.613053 1.43401
H  3.27843 -1.596279 0.229906
H  3.467632 -0.802547 -1.363071
H  5.198695 0.716739 -0.40063
H  4.808563 0.166825 1.247731
H  -2.565703 2.019779 0.460154
H  -3.000311 -2.87661 -0.472692
H  5.652014 -2.155936 0.672315
H  5.960088 -1.641852 -1.011224
H  6.915394 -0.941983 0.32527
H  -5.078504 -1.419579 -0.33878
H  -4.922208 2.085216 0.347306
