program: Orca
programVersion: 5.0.2
elementType: S O N N C C C C C C C C H H H H H H H H H H H H H H H H H H
charge: 0
multiplicity: 1
keywords: wb97x-d3
keywords: def2-TZVPP
keywords: def2/J RIJCOSX
keywords: DEFGRID2
keywords: scfconv7
keywords: smallprint printgap noloewdin
keywords: NOSOSCF
formula: C8H18N2OS
InChI: InChI=1/C8H18N2OS/c1-4-12-8(11)9-6-5-7-10(2)3/h9H,4-7H2,1-3H3
30 atoms
S  -1.863608 0.812408 -0.702346
O  -1.836668 -1.775293 -0.096131
N  2.486605 0.825475 -0.035755
N  0.174817 -0.771339 -0.431679
C  2.162332 -1.515252 0.804611
C  3.115295 -0.460732 0.251865
C  1.038888 -1.901279 -0.149013
C  2.13185 1.543253 1.173416
C  3.33911 1.641849 -0.875524
C  -1.155626 -0.798667 -0.350042
C  -3.614544 0.519531 -0.333837
C  -3.940176 0.529376 1.145797
H  2.751697 -2.412946 1.007255
H  1.740467 -1.20802 1.764861
H  3.536139 -0.840276 -0.683641
H  3.963386 -0.338258 0.945097
H  0.44493 -2.705847 0.282215
H  1.463506 -2.283345 -1.082956
H  1.449996 0.96042 1.792411
H  1.618999 2.471357 0.917083
H  3.006464 1.801035 1.789422
H  2.841729 2.584868 -1.107535
H  3.54022 1.132841 -1.819372
H  4.306548 1.880152 -0.408141
H  0.677183 0.104715 -0.5723
H  -4.139504 1.325418 -0.849219
H  -3.920403 -0.411239 -0.810386
H  -5.011864 0.378805 1.290209
H  -3.419706 -0.264605 1.67979
H  -3.67254 1.48082 1.605033
elementType: S O N C H
totalener: -898.71010904 hartree
nucrepener: 860.07801875 hartree
electener: -1758.78812779 hartree
oneelecener: -2936.85186284 hartree
twoeener: 1178.06373505 hartree
cpcmener: -0.01773442 hartree
kineticenergy: 895.66308508 hartree
xcener: -68.688451100182 hartree
chargesum: 0.0000000
charge: -0.137908 -0.520842 -0.241202 -0.204526 -0.144535 -0.070793 -0.019652 -0.206271 -0.189267 0.311491 -0.069809 -0.258674 0.083009 0.080284 0.091176 0.080676 0.093921 0.095084 0.101041 0.105994 0.090094 0.100888 0.099989 0.085130 0.175928 0.111078 0.093209 0.093711 0.087010 0.083768
qa: -0.1379 -0.5208 -0.2412 -0.2045 -0.1445 -0.0708 -0.0197 -0.2063 -0.1893 0.3115 -0.0698 -0.2587 0.0830 0.0803 0.0912 0.0807 0.0939 0.0951 0.1010 0.1060 0.0901 0.1009 0.1000 0.0851 0.1759 0.1111 0.0932 0.0937 0.0870 0.0838
va: 2.3053 1.9897 2.9271 3.1371 3.9271 3.8767 3.8510 3.9142 3.9080 4.3171 3.8976 3.9278 1.0176 1.0100 1.0000 1.0138 1.0286 1.0005 0.9979 0.9971 1.0084 0.9961 0.9977 1.0018 1.0685 1.0062 1.0295 1.0046 1.0134 1.0074
dispcorr: -0.011709699 hartree
energy: -898.721818741143
dipole: 10.84951 -9.18364 1.66587 3.66622 -2.78888 0.87734 5.82639 -5.53251 0.29387
magnitude: 1.90557 au
magnitude: 4.84358 debye
