program: Orca
programVersion: 5.0.2
elementType: S O N N C C C C C C C C H H H H H H H H H H H H H H H H H H
charge: 0
multiplicity: 1
keywords: wb97x-d3
keywords: def2-TZVPP
keywords: def2/J RIJCOSX
keywords: DEFGRID2
keywords: scfconv7
keywords: smallprint printgap noloewdin
keywords: NOSOSCF
formula: C8H18N2OS
InChI: InChI=1/C8H18N2OS/c1-4-12-8(11)9-6-5-7-10(2)3/h9H,4-7H2,1-3H3
30 atoms
S  -2.105678 0.485333 -1.128635
O  -1.546484 -1.706344 0.264633
N  2.761752 0.735831 -0.01258
N  0.165474 -0.78474 -0.901219
C  1.709721 -1.285515 0.982718
C  2.014539 0.202478 1.110915
C  1.192031 -1.671157 -0.401401
C  2.782824 2.18047 0.002964
C  4.101315 0.200434 -0.092009
C  -1.107843 -0.85062 -0.464732
C  -3.656726 0.183834 -0.241444
C  -3.643014 0.680706 1.191066
H  2.591721 -1.892685 1.204268
H  0.967115 -1.547957 1.738635
H  2.52474 0.388176 2.071994
H  1.067655 0.746246 1.163823
H  0.80382 -2.689098 -0.384784
H  2.002809 -1.651913 -1.129043
H  1.764235 2.571267 -0.003852
H  3.286448 2.557057 -0.888501
H  3.297733 2.603051 0.880263
H  4.083439 -0.884722 -0.193735
H  4.718937 0.442387 0.787784
H  4.608187 0.5980 -0.972237
H  0.485932 0.052673 -1.360478
H  -4.416662 0.69962 -0.829844
H  -3.872811 -0.882362 -0.291709
H  -4.616301 0.513177 1.655572
H  -2.898791 0.149301 1.780486
H  -3.425927 1.746946 1.239611
totalener: -898.69282219 hartree
nucrepener: 861.49890960 hartree
electener: -1760.19173178 hartree
oneelecener: -2939.33002486 hartree
twoeener: 1179.13829308 hartree
kineticenergy: 895.70132796 hartree
xcener: -68.689645155465 hartree
chargesum: 0.0000000
charge: -0.118879 -0.407016 -0.233195 -0.194071 -0.131344 -0.117828 -0.060995 -0.171497 -0.177076 0.289600 -0.089888 -0.251790 0.075248 0.098342 0.088040 0.094141 0.106822 0.097309 0.086851 0.089843 0.075683 0.081060 0.077034 0.092144 0.141379 0.100537 0.103099 0.082285 0.096640 0.077521
qa: -0.1189 -0.4070 -0.2332 -0.1941 -0.1313 -0.1178 -0.0610 -0.1715 -0.1771 0.2896 -0.0899 -0.2518 0.0752 0.0983 0.0880 0.0941 0.1068 0.0973 0.0869 0.0898 0.0757 0.0811 0.0770 0.0921 0.1414 0.1005 0.1031 0.0823 0.0966 0.0775
va: 2.3159 2.1017 2.8639 3.1427 3.7500 3.9132 3.9266 3.9318 3.9507 4.3314 3.9218 3.9268 1.0110 1.0222 1.0158 1.0029 1.0185 1.0053 1.0016 0.9986 1.0035 0.9999 1.0057 0.9992 1.0455 1.0069 1.0282 1.0071 1.0128 1.0088
dispcorr: -0.011977663 hartree
energy: -898.704799847928
dipole: 11.99568 -11.15714 0.83854 4.43264 -3.84543 0.58721 7.26659 -7.21523 0.05135
magnitude: 1.02499 au
magnitude: 2.60532 debye
