program: Orca
programVersion: 5.0.2
elementType: S O N N C C C C C C C C H H H H H H H H H H H H H H H H H H
charge: 0
multiplicity: 1
keywords: wb97x-d3
keywords: def2-TZVPP
keywords: def2/J RIJCOSX
keywords: DEFGRID2
keywords: scfconv7
keywords: smallprint printgap noloewdin
keywords: NOSOSCF
formula: C8H18N2OS
InChI: InChI=1/C8H18N2OS/c1-4-12-8(11)9-6-5-7-10(2)3/h9H,4-7H2,1-3H3
30 atoms
S  -2.146517 0.457704 1.055972
O  -1.527462 -1.758814 -0.271163
N  2.636142 0.879003 0.010875
N  0.156178 -0.758796 0.872972
C  1.737062 -1.213423 -0.991392
C  1.960686 0.28874 -1.129647
C  1.213595 -1.615645 0.386858
C  4.000258 0.42294 0.146426
C  2.572946 2.322498 -0.0234
C  -1.112828 -0.871157 0.433042
C  -3.677081 0.110175 0.150984
C  -3.6484 0.582676 -1.289847
H  1.024054 -1.521645 -1.758509
H  2.654935 -1.772927 -1.191761
H  0.986557 0.775963 -1.222028
H  2.491814 0.49237 -2.075303
H  2.014223 -1.575166 1.124904
H  0.854926 -2.643968 0.365377
H  4.041099 -0.660795 0.257479
H  4.449528 0.855267 1.041524
H  4.636304 0.693496 -0.711679
H  3.016302 2.738518 0.882433
H  1.53347 2.651405 -0.062978
H  3.09749 2.764866 -0.884907
H  0.453953 0.105816 1.296206
H  -3.873199 -0.959005 0.216308
H  -4.456691 0.620886 0.717495
H  -3.451918 1.652201 -1.353063
H  -2.882764 0.056953 -1.856636
H  -4.609341 0.387287 -1.768953
totalener: -898.69278469 hartree
nucrepener: 863.47568731 hartree
electener: -1762.16847200 hartree
oneelecener: -2943.27476743 hartree
twoeener: 1181.10629543 hartree
kineticenergy: 895.70203663 hartree
xcener: -68.689884207675 hartree
chargesum: -0.0000000
charge: -0.118966 -0.405676 -0.237703 -0.191284 -0.132387 -0.117646 -0.063950 -0.176298 -0.170903 0.286992 -0.089579 -0.252081 0.098210 0.076159 0.095461 0.089051 0.097617 0.107167 0.081108 0.092041 0.077227 0.090035 0.087211 0.076412 0.142079 0.103333 0.100236 0.077577 0.096048 0.082509
qa: -0.1190 -0.4057 -0.2377 -0.1913 -0.1324 -0.1176 -0.0640 -0.1763 -0.1709 0.2870 -0.0896 -0.2521 0.0982 0.0762 0.0955 0.0891 0.0976 0.1072 0.0811 0.0920 0.0772 0.0900 0.0872 0.0764 0.1421 0.1033 0.1002 0.0776 0.0960 0.0825
va: 2.3158 2.1034 2.8595 3.1383 3.7489 3.9100 3.9246 3.9491 3.9287 4.3349 3.9204 3.9275 1.0211 1.0109 1.0027 1.0157 1.0052 1.0189 1.0004 0.9992 1.0054 0.9987 1.0024 1.0036 1.0480 1.0285 1.0069 1.0087 1.0125 1.0073
dispcorr: -0.012062174 hartree
energy: -898.704846860474
dipole: 11.78101 -10.94036 0.84065 4.93455 -4.29744 0.63711 -7.20547 7.12217 -0.08329
magnitude: 1.05808 au
magnitude: 2.68942 debye
