program: Orca
programVersion: 5.0.2
elementType: S O N N C C C C C C C C H H H H H H H H H H H H H H H H H H
charge: 0
multiplicity: 1
keywords: wb97x-d3
keywords: def2-TZVPP
keywords: def2/J RIJCOSX
keywords: DEFGRID2
keywords: scfconv7
keywords: smallprint printgap noloewdin
keywords: NOSOSCF
formula: C8H18N2OS
InChI: InChI=1/C8H18N2OS/c1-4-12-8(11)9-6-5-7-10(2)3/h9H,4-7H2,1-3H3
30 atoms
S  -1.910043 0.772818 0.666189
O  -1.782967 -1.74101 -0.18746
N  2.475193 0.823301 0.176587
N  0.151598 -0.808557 0.56544
C  2.13114 -1.481631 -0.747242
C  3.099451 -0.436234 -0.202902
C  1.045648 -1.89618 0.241343
C  1.996824 1.573347 -0.966645
C  3.363102 1.62601 0.988436
C  -1.160673 -0.813314 0.270486
C  -3.600016 0.487584 0.078821
C  -3.757523 0.654456 -1.420147
H  1.669461 -1.150501 -1.68052
H  2.719581 -2.366887 -1.003196
H  3.910574 -0.273977 -0.93352
H  3.57451 -0.850108 0.691844
H  1.511968 -2.269977 1.159106
H  0.454729 -2.713395 -0.168374
H  1.238423 1.013121 -1.512258
H  2.799529 1.837055 -1.672197
H  1.527213 2.497879 -0.630616
H  4.283958 1.923447 0.463856
H  3.651987 1.076641 1.885098
H  2.853811 2.535586 1.308183
H  0.614643 0.053787 0.829327
H  -3.907063 -0.505908 0.402731
H  -4.208986 1.211574 0.621748
H  -3.441155 1.645131 -1.744767
H  -3.170945 -0.087927 -1.957256
H  -4.80292 0.524143 -1.705621
totalener: -898.69441492 hartree
nucrepener: 863.45268203 hartree
electener: -1762.14709695 hartree
oneelecener: -2943.30270767 hartree
twoeener: 1181.15561072 hartree
kineticenergy: 895.69699540 hartree
xcener: -68.690691611529 hartree
chargesum: -0.0000000
charge: -0.127352 -0.415616 -0.240990 -0.212612 -0.148424 -0.078788 -0.030277 -0.192214 -0.172081 0.291544 -0.087006 -0.250873 0.080197 0.077444 0.077807 0.080998 0.087111 0.103014 0.095223 0.083978 0.101416 0.079654 0.090325 0.093681 0.160361 0.101199 0.098409 0.075603 0.097293 0.080975
qa: -0.1274 -0.4156 -0.2410 -0.2126 -0.1484 -0.0788 -0.0303 -0.1922 -0.1721 0.2915 -0.0870 -0.2509 0.0802 0.0774 0.0778 0.0810 0.0871 0.1030 0.0952 0.0840 0.1014 0.0797 0.0903 0.0937 0.1604 0.1012 0.0984 0.0756 0.0973 0.0810
va: 2.3047 2.0988 2.9057 3.1243 3.9053 3.8851 3.8628 3.9207 3.9218 4.3258 3.9205 3.9250 1.0108 1.0200 1.0155 1.0021 1.0008 1.0339 1.0043 1.0086 0.9998 1.0019 1.0005 0.9996 1.0671 1.0288 1.0077 1.0090 1.0133 1.0072
dispcorr: -0.011904543 hartree
energy: -898.706319458927
dipole: 10.99348 -9.79878 1.19470 3.99102 -3.41263 0.57839 -5.48809 5.38200 -0.10608
magnitude: 1.33158 au
magnitude: 3.38460 debye
