program: Orca
programVersion: 5.0.2
elementType: S O N N C C C C C C C C H H H H H H H H H H H H H H H H H H
charge: 0
multiplicity: 1
keywords: wb97x-d3
keywords: def2-TZVPP
keywords: def2/J RIJCOSX
keywords: DEFGRID2
keywords: scfconv7
keywords: smallprint printgap noloewdin
keywords: NOSOSCF
formula: C8H18N2OS
InChI: InChI=1/C8H18N2OS/c1-4-12-8(11)9-6-5-7-10(2)3/h9H,4-7H2,1-3H3
30 atoms
S  -2.158149 0.51894 -1.066599
O  -1.585195 -1.70307 0.272426
N  2.750607 0.788299 -0.007643
N  0.129352 -0.721849 -0.840345
C  1.707407 -1.224529 1.013969
C  2.026575 0.261501 1.134199
C  1.163924 -1.609398 -0.360331
C  2.790085 2.232525 0.009352
C  4.081479 0.237567 -0.122879
C  -1.148868 -0.8200 -0.424864
C  -3.724733 0.158949 -0.228505
C  -3.760808 0.619526 1.215717
H  2.58808 -1.838184 1.222643
H  0.97503 -1.479496 1.782525
H  2.561627 0.443698 2.082302
H  1.08554 0.812707 1.209509
H  0.773491 -2.626121 -0.336326
H  1.96187 -1.592621 -1.10222
H  3.336807 2.6469 0.871203
H  1.776937 2.636467 0.034236
H  3.271075 2.604426 -0.896466
H  4.048687 -0.847068 -0.226151
H  4.724218 0.47097 0.741014
H  4.569654 0.631268 -1.015319
H  0.441675 0.126877 -1.284117
H  -4.481151 0.671231 -0.82429
H  -3.912754 -0.910542 -0.310801
H  -4.744288 0.425141 1.64709
H  -3.025105 0.085103 1.812953
H  -3.562657 1.687439 1.297371
totalener: -898.69287843 hartree
nucrepener: 859.47007889 hartree
electener: -1758.16295732 hartree
oneelecener: -2935.27030029 hartree
twoeener: 1177.10734297 hartree
kineticenergy: 895.69859017 hartree
xcener: -68.689204250907 hartree
chargesum: 0.0000000
charge: -0.120028 -0.407769 -0.233455 -0.194649 -0.129807 -0.117605 -0.062027 -0.171719 -0.177157 0.291591 -0.090526 -0.251649 0.075052 0.097113 0.087901 0.094320 0.106505 0.098520 0.075957 0.086875 0.090167 0.081088 0.077267 0.092240 0.141393 0.100653 0.103076 0.082407 0.097066 0.077198
qa: -0.1200 -0.4078 -0.2335 -0.1946 -0.1298 -0.1176 -0.0620 -0.1717 -0.1772 0.2916 -0.0905 -0.2516 0.0751 0.0971 0.0879 0.0943 0.1065 0.0985 0.0760 0.0869 0.0902 0.0811 0.0773 0.0922 0.1414 0.1007 0.1031 0.0824 0.0971 0.0772
va: 2.3144 2.1010 2.8642 3.1426 3.7545 3.9097 3.9234 3.9316 3.9498 4.3299 3.9222 3.9264 1.0111 1.0214 1.0158 1.0037 1.0199 1.0051 1.0035 1.0012 0.9986 1.0003 1.0056 0.9993 1.0453 1.0069 1.0282 1.0070 1.0128 1.0089
dispcorr: -0.011872743 hartree
energy: -898.704751175438
dipole: 12.03873 -11.19045 0.84828 4.32324 -3.72904 0.59420 7.03870 -6.98438 0.05432
magnitude: 1.03711 au
magnitude: 2.63612 debye
