program: Gaussian 09
title: 000066248
version: EM64L-G09RevD.01
frameworkgroup: C1[X(C22H28NO3)]
method: RPBEPBE
basis: SDD
operation: Freq
keyword: #p
keyword: freq=noraman
keyword: PBEPBE/SDD
title: #p freq=noraman PBEPBE/SDD
converged: YES YES NO NO
title: Mulliken charges:
elementType: O O O N C C C C C C C C C C C C C C C C C C C C C C H H H H H H H H H H H H H H H H H H H H H H H H H H H H
charge: -0.316562 -0.183901 -0.413565 -0.097593 -0.425512 -0.378738 -0.020497 -0.523341 -0.318326 -0.302078 -0.693473 -0.683852 0.161084 -0.121674 0.322671 0.485847 -0.416094 -0.378387 -0.391336 -0.339039 -0.233189 -0.238899 -0.247308 -0.238429 -0.243997 -0.231250 0.318336 0.280387 0.286245 0.278167 0.304226 0.289285 0.276151 0.253317 0.275693 0.287069 0.255420 0.269933 0.244230 0.246946 0.273283 0.235233 0.246656 0.348769 0.284730 0.252192 0.282657 0.221286 0.246296 0.237888 0.245965 0.236164 0.248281 0.242633
chargesum: 1.00000
title: Mulliken charges with hydrogens summed into heavy atoms:
elementType: O O O N C C C C C C C C C C C C C C C C C C C C C C
charge: -0.316562 -0.183901 -0.064797 -0.097593 0.173211 0.185675 0.283729 0.042095 0.210684 0.240410 0.067635 0.071320 0.161084 -0.121674 0.322671 0.485847 -0.131364 -0.126196 -0.108679 -0.117754 0.013108 -0.001011 -0.001343 -0.002265 0.004284 0.011383
polarizability: 2.74852812e+02 1.37495581e+01 2.59232652e+02 1.36120313e+01 4.07200476e-01 1.85730006e+02
1716.lowfreq: -13.5018 -8.6400 -0.0004 0.0003 0.0004 0.9906 11.7659 19.3238 33.6828
frequency: 10.7866 17.7079 33.2630 36.4715 48.9035 56.2597 73.5867 82.9898 91.8754 117.6294 126.1749 142.4570 159.8148 186.8753 202.0854 209.2134 220.6361 245.5131 253.5413 265.5642 283.9594 300.2697 313.3503 322.4568 331.3256 360.9084 371.5672 387.7097 399.4377 404.9405 407.9251 454.1557 462.6190 472.0716 490.6632 564.1326 587.5554 609.7810 614.3680 617.0030 646.2878 670.0253 692.1699 700.6470 713.1825 725.6497 744.6552 769.3486 773.6367 776.8560 797.1192 810.1409 823.4426 849.0717 857.4962 873.0792 883.7106 902.0720 917.7270 926.5178 933.6633 941.7112 948.1692 979.2362 985.9652 987.2109 992.6005 995.6795 999.5895 1004.7575 1007.7732 1010.7144 1019.1028 1027.1134 1029.3622 1043.5508 1056.0283 1068.7309 1092.0446 1096.2293 1104.1865 1106.0713 1118.3342 1148.6696 1153.8730 1173.5830 1175.2311 1178.6316 1182.2338 1192.3875 1196.5943 1204.2998 1221.8969 1229.4385 1269.0104 1298.9516 1304.3324 1308.2805 1312.9943 1317.7588 1324.3077 1326.2360 1349.3566 1356.3307 1376.8222 1377.8456 1383.4480 1384.4615 1408.9675 1416.5690 1432.5505 1438.6718 1451.6029 1466.7446 1468.4335 1472.8450 1476.1755 1478.6340 1479.3310 1484.7571 1484.9101 1489.1997 1498.2164 1587.2327 1595.8648 1602.8095 1612.9366 1649.4273 3003.5869 3007.4001 3028.2768 3040.2009 3041.2989 3048.7710 3051.1280 3074.8010 3088.4120 3094.6592 3095.2439 3100.8783 3110.0255 3114.5429 3119.3271 3126.0123 3126.8959 3130.1514 3135.8425 3137.4656 3142.0334 3146.7479 3148.9023 3158.0670 3159.4110 3169.8449 3172.8761 3518.3876
redmass: 3.6005 4.0416 3.3812 4.3985 4.0792 4.2659 2.2560 3.7041 3.5659 3.5150 2.3610 3.8806 3.5026 2.1353 5.3151 1.5307 2.1936 3.9771 2.7081 4.8247 4.7915 2.2798 2.1537 2.3156 1.7844 2.7291 3.5983 2.8090 2.8165 4.5071 2.8323 2.8607 2.5217 4.1861 3.6530 4.5609 3.0658 5.8770 6.4308 6.1592 4.1506 3.7753 6.8613 1.6781 2.1866 4.0361 2.8784 1.9144 1.5682 1.8650 2.0180 1.7062 1.6332 1.2573 2.4161 1.2394 3.6546 5.8081 2.3406 1.5433 2.0496 2.5803 1.5274 1.4138 5.2831 5.3039 5.7050 1.3909 2.2134 1.3501 2.0952 1.3539 2.0916 2.2787 2.2116 2.8894 2.6492 2.6240 1.6343 2.0039 2.1135 1.9352 1.9833 1.7609 2.5035 1.7254 1.1086 1.0549 2.0732 1.2406 1.1178 1.3031 1.4512 1.3337 1.2950 1.3349 1.5892 1.2131 1.2268 1.3853 1.3161 1.2115 1.3118 1.3113 1.3006 7.6224 1.3281 8.8696 1.2034 1.2000 2.1670 2.2131 1.0688 1.0652 1.0559 1.0850 2.0354 1.0726 1.0565 1.4922 1.4114 1.0564 1.0845 6.1288 6.1799 5.9000 6.0736 12.2253 1.0374 1.0375 1.0619 1.0604 1.0619 1.0648 1.0636 1.0876 1.1032 1.0997 1.1006 1.0981 1.1036 1.1031 1.1048 1.0878 1.0872 1.1056 1.0876 1.0868 1.1035 1.0927 1.0918 1.0948 1.0957 1.1010 1.1015 1.0648
irintensity: 0.0163 0.2397 0.8490 2.2968 2.1762 0.3679 1.4323 1.7452 0.9482 0.0465 0.7076 1.2825 1.3865 0.3308 5.6588 1.0094 4.2160 4.2831 0.5562 5.0966 0.8430 58.0753 2.4448 2.9545 54.9144 15.3805 13.1655 1.4400 0.0431 2.3691 4.4894 2.5430 2.0838 2.5936 2.9976 7.3211 4.2935 15.3558 0.4620 4.8088 29.4219 4.9861 3.3810 50.6535 40.6322 1.6678 24.8010 14.4218 40.0270 86.9914 16.3833 26.8526 4.2585 0.0696 7.2956 0.0176 113.6407 5.9411 11.4854 7.5023 7.6134 63.5274 12.8013 0.8058 40.3791 20.2540 9.3337 0.1156 33.2173 1.6114 19.3705 0.5731 24.5840 2.0774 9.1243 17.7769 117.7765 120.1886 0.9314 82.8558 2.5153 11.0416 25.5747 8.8475 27.4147 4.4319 1.8432 0.2695 8.1825 1.8768 2.5101 10.9022 3.2514 1.9025 2.9365 13.4924 66.4286 10.4319 0.6365 11.9535 2.1296 4.2703 2.6175 18.2136 5.5446 0.3339 2.9551 0.1250 23.4308 27.6136 16.9731 13.5380 13.5242 30.7709 28.2910 36.5118 16.2327 25.4114 19.4682 7.9767 9.3293 12.9016 13.0256 0.6184 0.5708 3.4958 1.3277 103.1089 5.3729 3.4492 8.1655 6.6018 11.5772 5.0432 2.0970 4.3818 1.0167 6.0244 3.1182 9.3900 0.8476 21.0114 13.7099 10.6442 1.6797 4.3892 1.2460 0.3008 0.9876 8.0990 13.0926 6.8158 22.2288 16.1873 13.6694 8.9240
temp: 298.150 k
press: 1.00000 atm
elementType: 8 8 8 7 6 6 6 6 6 6 6 6 6 6 6 6 6 6 6 6 6 6 6 6 6 6 1 1 1 1 1 1 1 1 1 1 1 1 1 1 1 1 1 1 1 1 1 1 1 1 1 1 1 1
symmnumber: 1
zpe: 1194903.4 jmol-1
zpe.correction: 0.455115 hartree
zpe.thermalcorrener: 0.480456 hartree
zpe.thermalcorrenthalpy: 0.481401 hartree
zpe.thermalcorrgfe: 0.397678 hartree
zpe.sumelectzpe: -1133.384963 hartree
zpe.sumelectthermal: -1133.359622 hartree
zpe.sumelectthermalent: -1133.358677 hartree
zpe.sumelectthermalfe: -1133.442400 hartree
dipole: 16.0542 -1.1159 -0.6118
dipole: 16.1046
quadrupole: -67.5751 -121.8839 -147.7661
quadrupole: -10.0448 2.0512 -1.5864
quadrupole: 44.8332 -9.4756 -35.3577 -10.0448 2.0512 -1.5864
hfenergy: -1133.840078 hartree
pointgroup: C01 [X(C22H28N1O3)]
dipole: 6.3319062 0.2281617 -0.0132602 debye
polarizability: 273.223079|-20.5007384|235.9997946|-3.9380396|-34.8044962|210.592596 unknown
InChI: InChI=1S/C22H28NO3/c1-3-23(4-2)16-15-20(17-23)26-21(24)22(25,18-11-7-5-8-12-18)19-13-9-6-10-14-19/h5-14,20,25H,3-4,15-17H2,1-2H3
charge 1 multiplicity 1
54 atoms
O  0.842388 0.72917 -1.17019
O  -0.277163 2.072403 0.36791
O  -1.361213 -0.560596 -1.886212
N  3.892777 0.507863 -0.068068
C  2.761412 1.50932 0.237337
C  4.293126 0.88576 -1.513313
C  1.985493 1.67809 -1.083934
C  2.979104 1.303127 -2.214854
C  5.061634 0.708748 0.920011
C  3.361689 -0.955807 -0.045536
C  6.263398 -0.209407 0.674353
C  2.976967 -1.481766 1.339965
C  -0.293821 1.074521 -0.373444
C  -1.398388 -0.006334 -0.523198
C  -1.048928 -1.078053 0.543725
C  -2.796933 0.602667 -0.356519
C  -0.935126 -2.437131 0.16813
C  -3.777838 -0.003391 0.461267
C  -0.881664 -0.712608 1.905675
C  -3.135865 1.754685 -1.109749
C  -0.645436 -3.422247 1.142019
C  -5.079397 0.542359 0.533624
C  -0.595692 -1.6985 2.87578
C  -4.432861 2.300609 -1.036353
C  -0.471692 -3.057039 2.496791
C  -5.40983 1.695904 -0.210499
H  2.142674 1.152605 1.071506
H  3.237531 2.461035 0.528974
H  4.800495 0.033601 -1.988226
H  5.001168 1.728095 -1.437791
H  1.583609 2.701192 -1.158966
H  2.551735 0.485479 -2.816297
H  3.157518 2.151392 -2.893882
H  5.354509 1.769717 0.825999
H  4.645701 0.560527 1.930205
H  2.48796 -0.967943 -0.717046
H  4.160826 -1.569001 -0.49424
H  7.052325 0.059149 1.398316
H  6.028612 -1.274837 0.833913
H  6.694028 -0.084807 -0.333842
H  2.54076 -2.487223 1.205411
H  3.839873 -1.58547 2.018672
H  2.194841 -0.87978 1.832196
H  -0.414811 -0.727522 -2.140245
H  -1.119299 -2.719905 -0.873159
H  -3.538098 -0.902394 1.037413
H  -1.011146 0.332273 2.212468
H  -2.392564 2.217728 -1.769442
H  -0.583564 -4.47514 0.845586
H  -5.833905 0.063792 1.166797
H  -0.494626 -1.411512 3.928251
H  -4.685039 3.190972 -1.62197
H  -0.267666 -3.823348 3.252389
H  -6.418588 2.11848 -0.15251
