program: Orca
programVersion: 5.0.2
elementType: O O N N C C C C C C C C C H H H H H H H H H H H H H H H H H H H H
charge: 0
multiplicity: 1
keywords: wb97x-d3
keywords: def2-TZVPP
keywords: def2/J RIJCOSX
keywords: DEFGRID2
keywords: scfconv7
keywords: smallprint printgap noloewdin
keywords: NOSOSCF
formula: C9H20N2O2
InChI: InChI=1/C9H20N2O2/c1-4-8-13-9(12)10-6-5-7-11(2)3/h10H,4-8H2,1-3H3
33 atoms
O  -2.573959 -0.003301 0.021781
O  -1.208124 1.542357 -0.887764
N  4.15982 -0.68501 -0.467452
N  -0.545483 0.24974 0.86413
C  1.762632 -0.300561 0.13906
C  3.19599 0.207081 0.162019
C  0.840968 0.661109 0.877889
C  5.420602 0.011325 -0.638173
C  4.377312 -1.870432 0.34033
C  -3.640018 0.399162 -0.846349
C  -4.820488 -0.513035 -0.599919
C  -1.417376 0.662476 -0.069557
C  -5.381312 -0.439397 0.812394
H  1.424465 -0.408663 -0.894605
H  1.685238 -1.284893 0.607331
H  3.488344 0.430092 1.202665
H  3.226347 1.160545 -0.370908
H  1.155124 0.744661 1.919051
H  0.912821 1.662438 0.45507
H  -0.795112 -0.553005 1.421582
H  5.85976 0.358203 0.309189
H  5.289689 0.882811 -1.280793
H  6.149533 -0.643165 -1.117314
H  3.465514 -2.458247 0.436793
H  4.734889 -1.63913 1.355319
H  5.121384 -2.511764 -0.132745
H  -3.32114 0.331889 -1.888408
H  -3.91327 1.437592 -0.640271
H  -5.59162 -0.221167 -1.316548
H  -4.548033 -1.542002 -0.848285
H  -5.660021 0.582772 1.074723
H  -6.274898 -1.056906 0.905165
H  -4.666947 -0.790928 1.556965
elementType: O N C H
totalener: -615.06072818 hartree
nucrepener: 818.89760301 hartree
electener: -1433.95833119 hartree
oneelecener: -2459.57180722 hartree
twoeener: 1025.61347603 hartree
cpcmener: -0.02816906 hartree
kineticenergy: 612.20594589 hartree
xcener: -59.908950152620 hartree
chargesum: -0.0000000
charge: -0.336096 -0.575494 -0.236418 -0.241067 -0.067779 -0.123687 -0.037377 -0.192887 -0.197279 0.021248 -0.099894 0.534779 -0.257293 0.062892 0.072126 0.072949 0.093249 0.104323 0.087854 0.176027 0.075935 0.098597 0.100303 0.101449 0.077390 0.101520 0.104809 0.098649 0.066319 0.064080 0.079010 0.091672 0.080090
qa: -0.3361 -0.5755 -0.2364 -0.2411 -0.0678 -0.1237 -0.0374 -0.1929 -0.1973 0.0212 -0.0999 0.5348 -0.2573 0.0629 0.0721 0.0729 0.0932 0.1043 0.0879 0.1760 0.0759 0.0986 0.1003 0.1014 0.0774 0.1015 0.1048 0.0986 0.0663 0.0641 0.0790 0.0917 0.0801
va: 2.0638 1.9220 2.8964 3.2061 3.7972 3.9578 3.8800 3.9273 3.9296 3.8446 3.9479 4.2752 3.9156 1.0299 1.0231 1.0085 1.0005 1.0023 1.0238 1.0140 1.0023 0.9968 0.9948 0.9942 1.0057 0.9946 1.0037 0.9984 1.0114 1.0137 1.0025 1.0046 1.0098
dispcorr: -0.010729193 hartree
energy: -615.071457372366
dipole: 7.02924 -6.97951 0.04974 -5.03378 3.97315 -1.06063 2.91151 -1.58126 1.33025
magnitude: 1.70205 au
magnitude: 4.32626 debye
