program: Orca
programVersion: 5.0.2
elementType: O O N N C C C C C C C C C H H H H H H H H H H H H H H H H H H H H
charge: 0
multiplicity: 1
keywords: wb97x-d3
keywords: def2-TZVPP
keywords: def2/J RIJCOSX
keywords: DEFGRID2
keywords: scfconv7
keywords: smallprint printgap noloewdin
keywords: NOSOSCF
formula: C9H20N2O2
InChI: InChI=1/C9H20N2O2/c1-4-8-13-9(12)10-6-5-7-11(2)3/h10H,4-8H2,1-3H3
33 atoms
O  -2.432543 0.321051 -0.627747
O  -1.243959 0.715533 1.247401
N  4.079866 -1.003091 0.549667
N  -0.310757 0.920393 -0.815443
C  1.834314 -0.144434 -0.14833
C  3.232384 0.165973 0.362332
C  1.04356 1.140491 -0.356675
C  5.28921 -0.609843 1.24739
C  4.438371 -1.596411 -0.724704
C  -3.61816 0.102436 0.14523
C  -4.738646 -0.252511 -0.807097
C  -1.316273 0.65083 0.031151
C  -6.042944 -0.459299 -0.052319
H  1.872255 -0.685963 -1.09652
H  1.313401 -0.784645 0.568129
H  3.137848 0.667101 1.329447
H  3.712849 0.894953 -0.313865
H  1.012654 1.724798 0.563309
H  1.54178 1.764038 -1.099284
H  -0.449031 0.731703 -1.796281
H  5.045816 -0.194703 2.226025
H  5.880601 0.142759 0.704005
H  5.929868 -1.47733 1.408753
H  5.108312 -2.441888 -0.56571
H  4.947105 -0.890878 -1.399657
H  3.561461 -1.978939 -1.24525
H  -3.868567 1.006621 0.70662
H  -3.457634 -0.70709 0.861855
H  -4.86206 0.544447 -1.54438
H  -4.480989 -1.161228 -1.356296
H  -5.958158 -1.260653 0.683352
H  -6.344917 0.445649 0.477246
H  -6.849539 -0.725007 -0.734909
elementType: O N C H
totalener: -615.06120541 hartree
nucrepener: 814.54178601 hartree
electener: -1429.60299142 hartree
oneelecener: -2450.89362304 hartree
twoeener: 1021.29063163 hartree
cpcmener: -0.02857099 hartree
kineticenergy: 612.20297766 hartree
xcener: -59.908224647276 hartree
chargesum: -0.0000000
charge: -0.332709 -0.577222 -0.234360 -0.244364 -0.071573 -0.124919 -0.039785 -0.194249 -0.197989 0.035405 -0.087365 0.534798 -0.277167 0.071238 0.064135 0.092496 0.073539 0.090826 0.105764 0.178559 0.098900 0.075711 0.100738 0.101481 0.077876 0.101854 0.093578 0.094408 0.064417 0.065596 0.082927 0.083457 0.094002
qa: -0.3327 -0.5772 -0.2344 -0.2444 -0.0716 -0.1249 -0.0398 -0.1942 -0.1980 0.0354 -0.0874 0.5348 -0.2772 0.0712 0.0641 0.0925 0.0735 0.0908 0.1058 0.1786 0.0989 0.0757 0.1007 0.1015 0.0779 0.1019 0.0936 0.0944 0.0644 0.0656 0.0829 0.0835 0.0940
va: 2.0715 1.9172 2.8962 3.2039 3.7714 3.9591 3.8811 3.9283 3.9281 3.8425 3.9261 4.2734 3.9513 1.0237 1.0338 1.0010 1.0082 1.0187 1.0038 1.0137 0.9968 1.0027 0.9949 0.9944 1.0054 0.9941 0.9983 0.9992 1.0104 1.0101 1.0013 1.0012 1.0035
dispcorr: -0.010534512 hartree
energy: -615.071739922513
dipole: 6.11134 -5.83997 0.27137 -3.99637 4.10559 0.10923 -1.60675 -0.14866 -1.75541
magnitude: 1.77961 au
magnitude: 4.52342 debye
