program: Orca
programVersion: 5.0.2
elementType: O O N N C C C C C C C C C H H H H H H H H H H H H H H H H H H H H
charge: 0
multiplicity: 1
keywords: wb97x-d3
keywords: def2-TZVPP
keywords: def2/J RIJCOSX
keywords: DEFGRID2
keywords: scfconv7
keywords: smallprint printgap noloewdin
keywords: NOSOSCF
formula: C9H20N2O2
InChI: InChI=1/C9H20N2O2/c1-4-8-13-9(12)10-6-5-7-11(2)3/h10H,4-8H2,1-3H3
33 atoms
O  -2.147716 0.102992 0.058969
O  -1.228812 1.875782 -0.987096
N  3.79559 -0.892427 -0.091668
N  -0.206805 0.87594 0.782017
C  2.124642 0.971168 -0.103613
C  2.61843 -0.315125 0.541359
C  1.024377 1.634956 0.714628
C  3.504088 -1.331612 -1.442739
C  4.249415 -2.023863 0.692748
C  -3.315066 0.185989 -0.767817
C  -4.188877 -1.010764 -0.465739
C  -1.189615 1.016863 -0.121701
C  -4.659455 -1.090624 0.979071
H  2.953432 1.679065 -0.182792
H  1.7566 0.796824 -1.117653
H  1.796679 -1.050668 0.580268
H  2.877536 -0.094477 1.580791
H  1.37103 1.795361 1.736347
H  0.802453 2.61985 0.308125
H  -0.230421 0.069163 1.386955
H  4.384613 -1.808242 -1.874853
H  3.248802 -0.489938 -2.085594
H  2.67589 -2.055339 -1.492167
H  3.504686 -2.830632 0.765562
H  4.492688 -1.707476 1.70785
H  5.15325 -2.449137 0.255174
H  -3.03126 0.190117 -1.821886
H  -3.851072 1.115206 -0.556274
H  -5.052956 -0.939812 -1.130195
H  -3.663359 -1.927577 -0.744948
H  -5.340282 -1.930819 1.116338
H  -3.830817 -1.229264 1.673307
H  -5.192007 -0.184369 1.273285
elementType: O N C H
totalener: -615.06030453 hartree
nucrepener: 837.86988882 hartree
electener: -1452.93019335 hartree
oneelecener: -2497.34086847 hartree
twoeener: 1044.41067512 hartree
cpcmener: -0.02772305 hartree
kineticenergy: 612.20900075 hartree
xcener: -59.909894132473 hartree
chargesum: 0.0000000
charge: -0.334536 -0.576682 -0.231306 -0.236788 -0.070177 -0.116597 -0.068457 -0.200450 -0.192717 0.018280 -0.099683 0.538851 -0.258061 0.068177 0.070543 0.070344 0.089270 0.107466 0.098229 0.180976 0.101367 0.101355 0.078707 0.075137 0.098572 0.100002 0.103874 0.101695 0.066467 0.064673 0.091685 0.080409 0.079375
qa: -0.3345 -0.5767 -0.2313 -0.2368 -0.0702 -0.1166 -0.0685 -0.2004 -0.1927 0.0183 -0.0997 0.5389 -0.2581 0.0682 0.0705 0.0703 0.0893 0.1075 0.0982 0.1810 0.1014 0.1014 0.0787 0.0751 0.0986 0.1000 0.1039 0.1017 0.0665 0.0647 0.0917 0.0804 0.0794
va: 2.0650 1.9202 2.9003 3.1875 3.7843 3.9297 3.9164 3.9296 3.9283 3.8468 3.9464 4.2728 3.9159 1.0283 1.0234 1.0164 1.0012 1.0014 1.0218 1.0112 0.9942 0.9935 1.0044 1.0040 0.9964 0.9954 1.0044 0.9971 1.0114 1.0137 1.0044 1.0100 1.0026
dispcorr: -0.011216907 hartree
energy: -615.071521439373
dipole: 4.18454 -4.28447 -0.09993 -9.49177 8.10293 -1.38884 1.62973 -0.61575 1.01398
magnitude: 1.72251 au
magnitude: 4.37827 debye
