program: Orca
programVersion: 5.0.2
elementType: O O N N C C C C C C C C C H H H H H H H H H H H H H H H H H H H H
charge: 0
multiplicity: 1
keywords: wb97x-d3
keywords: def2-TZVPP
keywords: def2/J RIJCOSX
keywords: DEFGRID2
keywords: scfconv7
keywords: smallprint printgap noloewdin
keywords: NOSOSCF
formula: C9H20N2O2
InChI: InChI=1/C9H20N2O2/c1-4-8-13-9(12)10-6-5-7-11(2)3/h10H,4-8H2,1-3H3
33 atoms
O  -2.533936 0.584157 -0.288649
O  -1.104158 0.780508 1.443208
N  4.026078 -1.001102 -0.191826
N  -0.436688 1.154294 -0.698388
C  1.720559 -0.044383 -0.392398
C  3.177918 0.168253 -0.014504
C  0.974654 1.284162 -0.408669
C  5.396545 -0.644401 0.117087
C  3.605567 -2.09217 0.665771
C  -3.621636 0.323112 0.606925
C  -4.839801 -0.022498 -0.218896
C  -1.333711 0.828584 0.245757
C  -4.69742 -1.308301 -1.01847
H  1.653236 -0.505386 -1.38113
H  1.230105 -0.718676 0.313624
H  3.223373 0.536829 1.025161
H  3.586528 0.969251 -0.637822
H  1.093502 1.800264 0.54432
H  1.402796 1.939625 -1.167084
H  -0.705617 1.048002 -1.664775
H  6.055376 -1.497907 -0.045969
H  5.535863 -0.309962 1.156462
H  5.734723 0.161026 -0.53621
H  2.617815 -2.456246 0.385254
H  3.572995 -1.817839 1.731469
H  4.295708 -2.929832 0.562715
H  -3.812552 1.207484 1.218811
H  -3.370469 -0.504554 1.274422
H  -5.673073 -0.116894 0.480536
H  -5.089675 0.81265 -0.877669
H  -3.913611 -1.239347 -1.772661
H  -4.459135 -2.15116 -0.36788
H  -5.626266 -1.546346 -1.536689
elementType: O N C H
totalener: -615.06109608 hartree
nucrepener: 825.78429329 hartree
electener: -1440.84538937 hartree
oneelecener: -2473.40784458 hartree
twoeener: 1032.56245521 hartree
cpcmener: -0.02731395 hartree
kineticenergy: 612.21052958 hartree
xcener: -59.909721966684 hartree
chargesum: 0.0000000
charge: -0.335584 -0.576660 -0.230224 -0.245466 -0.076134 -0.122342 -0.037650 -0.192980 -0.203327 0.017502 -0.100400 0.538625 -0.257051 0.065073 0.074748 0.071965 0.086329 0.091224 0.106918 0.178096 0.100447 0.075825 0.099127 0.100555 0.080286 0.101830 0.110603 0.096119 0.066892 0.064460 0.080178 0.079099 0.091917
qa: -0.3356 -0.5767 -0.2302 -0.2455 -0.0761 -0.1223 -0.0376 -0.1930 -0.2033 0.0175 -0.1004 0.5386 -0.2571 0.0651 0.0747 0.0720 0.0863 0.0912 0.1069 0.1781 0.1004 0.0758 0.0991 0.1006 0.0803 0.1018 0.1106 0.0961 0.0669 0.0645 0.0802 0.0791 0.0919
va: 2.0666 1.9190 2.8947 3.2038 3.7935 3.9528 3.8786 3.9288 3.9318 3.8429 3.9456 4.2691 3.9153 1.0282 1.0240 1.0073 1.0010 1.0175 1.0042 1.0132 0.9953 1.0041 0.9959 0.9942 1.0028 0.9953 1.0012 1.0013 1.0112 1.0139 1.0098 1.0027 1.0044
dispcorr: -0.010900423 hartree
energy: -615.071996505056
dipole: 6.45583 -6.59464 -0.13882 -6.69501 6.76286 0.06786 -1.17128 0.06517 -1.10612
magnitude: 1.11686 au
magnitude: 2.83883 debye
