program: Orca
programVersion: 5.0.2
elementType: O O N N C C C C C C C C C H H H H H H H H H H H H H H H H H H H H
charge: 0
multiplicity: 1
keywords: wb97x-d3
keywords: def2-TZVPP
keywords: def2/J RIJCOSX
keywords: DEFGRID2
keywords: scfconv7
keywords: smallprint printgap noloewdin
keywords: NOSOSCF
formula: C9H20N2O2
InChI: InChI=1/C9H20N2O2/c1-4-8-13-9(12)10-6-5-7-11(2)3/h10H,4-8H2,1-3H3
33 atoms
O  -2.544322 0.106303 -0.174742
O  -1.167914 1.213833 1.22415
N  4.15898 -0.952336 -0.102171
N  -0.501694 0.596911 -0.862904
C  1.764799 -0.256302 -0.328372
C  3.224124 0.15769 -0.21195
C  0.896833 0.935846 -0.712039
C  3.950041 -1.697872 1.123073
C  5.515494 -0.442332 -0.131404
C  -3.603465 0.152213 0.789288
C  -4.784035 -0.603451 0.222667
C  -1.379855 0.674991 0.15015
C  -5.354773 -0.003009 -1.052777
H  1.660779 -1.032114 -1.091821
H  1.396411 -0.67533 0.611466
H  3.332106 0.855337 0.637467
H  3.494315 0.726093 -1.107332
H  0.986461 1.730734 0.027367
H  1.243182 1.353875 -1.658486
H  -0.750005 0.024821 -1.656159
H  4.68349 -2.501391 1.196923
H  2.965196 -2.162658 1.137783
H  4.043295 -1.077614 2.027749
H  5.744008 0.237161 0.704334
H  5.694804 0.102815 -1.058833
H  6.229521 -1.265816 -0.09069
H  -3.876104 1.19164 0.992949
H  -3.276166 -0.304343 1.726173
H  -4.506509 -1.648065 0.061472
H  -5.551761 -0.608518 0.999999
H  -5.650495 1.036644 -0.901867
H  -4.640975 -0.029689 -1.875997
H  -6.239819 -0.552199 -1.373786
elementType: O N C H
totalener: -615.06084688 hartree
nucrepener: 820.98285110 hartree
electener: -1436.04369798 hartree
oneelecener: -2463.71636965 hartree
twoeener: 1027.67267167 hartree
cpcmener: -0.02719591 hartree
kineticenergy: 612.20274102 hartree
xcener: -59.908030255842 hartree
chargesum: 0.0000000
charge: -0.334305 -0.576719 -0.230082 -0.241513 -0.068086 -0.123648 -0.033993 -0.200806 -0.193789 0.019476 -0.100582 0.534041 -0.257459 0.063691 0.073393 0.072905 0.085554 0.088047 0.104590 0.175297 0.101387 0.100710 0.078656 0.075860 0.098974 0.100708 0.099550 0.106064 0.064222 0.066491 0.079226 0.080334 0.091806
qa: -0.3343 -0.5767 -0.2301 -0.2415 -0.0681 -0.1236 -0.0340 -0.2008 -0.1938 0.0195 -0.1006 0.5340 -0.2575 0.0637 0.0734 0.0729 0.0856 0.0880 0.1046 0.1753 0.1014 0.1007 0.0787 0.0759 0.0990 0.1007 0.0995 0.1061 0.0642 0.0665 0.0792 0.0803 0.0918
va: 2.0668 1.9204 2.8957 3.2056 3.8069 3.9540 3.8795 3.9306 3.9295 3.8438 3.9487 4.2769 3.9148 1.0289 1.0189 1.0071 1.0009 1.0232 1.0033 1.0137 0.9948 0.9943 1.0038 1.0038 0.9961 0.9949 0.9980 1.0033 1.0140 1.0113 1.0026 1.0100 1.0044
dispcorr: -0.010782508 hartree
energy: -615.071629390217
dipole: 6.35297 -6.40274 -0.04977 -4.14777 3.56008 -0.58769 -0.71393 -0.23011 -0.94405
magnitude: 1.11314 au
magnitude: 2.82937 debye
