program: Orca
programVersion: 5.0.2
elementType: O O N N C C C C C C C C C H H H H H H H H H H H H H H H H H H H H
charge: 0
multiplicity: 1
keywords: wb97x-d3
keywords: def2-TZVPP
keywords: def2/J RIJCOSX
keywords: DEFGRID2
keywords: scfconv7
keywords: smallprint printgap noloewdin
keywords: NOSOSCF
formula: C9H20N2O2
InChI: InChI=1/C9H20N2O2/c1-4-8-13-9(12)10-6-5-7-11(2)3/h10H,4-8H2,1-3H3
33 atoms
O  -2.230875 0.673193 -0.96822
O  -1.55237 1.729332 0.910168
N  3.048692 -1.490253 0.435528
N  -0.121195 1.315503 -0.807563
C  1.79996 0.671427 0.655747
C  2.384773 -0.395183 -0.257515
C  1.077907 1.761227 -0.12817
C  4.233772 -1.031086 1.135136
C  3.429742 -2.503667 -0.528986
C  -3.571918 0.568075 -0.473133
C  -3.759007 -0.56856 0.511728
C  -1.314281 1.264854 -0.192998
C  -3.387434 -1.932898 -0.047691
H  1.113285 0.222015 1.37826
H  2.589833 1.160467 1.230649
H  3.069761 0.091832 -0.97497
H  1.579259 -0.830802 -0.855462
H  0.815895 2.585096 0.533879
H  1.747206 2.177063 -0.883506
H  -0.012008 0.804758 -1.67061
H  4.962765 -0.539324 0.472457
H  4.7359 -1.876149 1.607298
H  3.979954 -0.329232 1.92839
H  4.131744 -2.134815 -1.292715
H  2.549176 -2.88556 -1.047249
H  3.905903 -3.345712 -0.024971
H  -4.173725 0.391519 -1.365031
H  -3.89276 1.518354 -0.042651
H  -3.203475 -0.37224 1.430617
H  -4.816282 -0.561338 0.790044
H  -3.591582 -2.717041 0.681822
H  -3.961083 -2.163803 -0.947398
H  -2.328774 -1.996707 -0.302338
elementType: O N C H
totalener: -615.05998875 hartree
nucrepener: 849.71439613 hartree
electener: -1464.77438488 hartree
oneelecener: -2521.23187084 hartree
twoeener: 1056.45748595 hartree
cpcmener: -0.02783738 hartree
kineticenergy: 612.19263790 hartree
xcener: -59.907501618934 hartree
chargesum: -0.0000000
charge: -0.343986 -0.575523 -0.233267 -0.241017 -0.075445 -0.115139 -0.063904 -0.200056 -0.192854 0.022122 -0.110937 0.535417 -0.262188 0.063347 0.078353 0.070965 0.087795 0.100083 0.109327 0.180700 0.078375 0.100879 0.101626 0.075559 0.098575 0.100352 0.110476 0.104944 0.066373 0.076307 0.092566 0.080315 0.079861
qa: -0.3440 -0.5755 -0.2333 -0.2410 -0.0754 -0.1151 -0.0639 -0.2001 -0.1929 0.0221 -0.1109 0.5354 -0.2622 0.0633 0.0784 0.0710 0.0878 0.1001 0.1093 0.1807 0.0784 0.1009 0.1016 0.0756 0.0986 0.1004 0.1105 0.1049 0.0664 0.0763 0.0926 0.0803 0.0799
va: 2.0534 1.9181 2.9031 3.1928 3.7811 3.9310 3.9097 3.9290 3.9282 3.8492 3.8651 4.2860 3.9256 1.0311 1.0197 1.0090 1.0104 1.0204 1.0003 1.0115 1.0040 0.9948 0.9940 1.0037 0.9965 0.9950 0.9976 1.0148 1.0235 1.0129 1.0041 1.0013 1.0085
dispcorr: -0.011751876 hartree
energy: -615.071740630868
dipole: 8.54399 -7.81058 0.73341 -10.00823 9.47768 -0.53056 0.34309 -1.76153 -1.41844
magnitude: 1.68266 au
magnitude: 4.27699 debye
