program: Gaussian 09
title: 000065915
version: EM64L-G09RevD.01
frameworkgroup: C1[X(C18H12Cl2N2O)]
method: RPBEPBE
basis: SDD
operation: Freq
keyword: #p
keyword: freq=noraman
keyword: PBEPBE/SDD
title: #p freq=noraman PBEPBE/SDD
converged: YES YES NO NO
title: Mulliken charges:
elementType: Cl Cl O N N C C C C C C C C C C C C C C C C C C H H H H H H H H H H H H
charge: -0.047395 -0.058876 -0.285021 -0.110874 -0.097297 -0.440122 0.479168 0.598839 -0.525192 0.323744 0.171878 -0.348717 -0.366972 -0.142798 -0.195530 -0.390244 -0.343935 -0.235306 -0.236987 -0.338775 -0.111040 -0.194462 -0.226874 0.258045 0.275065 0.278786 0.269929 0.255270 0.274464 0.262179 0.260178 0.236859 0.251229 0.260422 0.240367
chargesum: 0.00000
title: Mulliken charges with hydrogens summed into heavy atoms:
elementType: Cl Cl O N N C C C C C C C C C C C C C C C C C C
charge: -0.047395 -0.058876 -0.285021 -0.110874 -0.097297 -0.182078 0.479168 0.598839 -0.250127 0.323744 0.171878 -0.348717 -0.088187 0.127131 0.059740 -0.115781 -0.081756 0.024873 -0.000128 -0.087547 -0.111040 0.065960 0.013492
polarizability: 3.01752845e+02 4.62988938e+00 1.82314110e+02 -8.26710816e+00 -1.45493109e+01 1.97971454e+02
1716.lowfreq: -9.7980 -5.1040 -0.0012 -0.0008 0.0011 4.1903 9.8683 22.4254 28.4553
frequency: 9.5858 22.3088 28.3759 42.5206 55.1279 66.8321 98.9299 135.3800 149.3786 172.6063 190.1343 229.8956 248.7378 272.4420 294.9215 303.3278 338.6775 371.9286 387.9131 406.7160 431.8794 446.1375 461.2719 520.9430 567.8669 579.0547 600.0862 617.3279 647.0593 650.9494 671.5423 693.1163 709.7196 724.5545 733.9125 747.1717 759.2231 767.5645 796.9277 803.6704 819.9709 831.8487 843.5791 850.7004 875.6016 877.9265 881.9782 890.7726 912.0577 939.1563 960.4839 994.3287 1000.5104 1015.4132 1040.3137 1050.9177 1051.3591 1106.3286 1106.9737 1123.1027 1141.9144 1162.6170 1175.0046 1189.1020 1204.0444 1219.2186 1239.0146 1252.4605 1254.2023 1257.3954 1284.1736 1312.5020 1331.6046 1373.8987 1380.6147 1396.4985 1426.4798 1434.4629 1442.6313 1443.7432 1462.1245 1474.1878 1576.0716 1580.9297 1595.8895 1603.6151 1620.6499 3027.3810 3140.6733 3155.1203 3167.2343 3167.6818 3175.4066 3178.3474 3185.5852 3224.2053 3228.3003 3232.3786 3262.5953
redmass: 5.8067 8.6296 5.7936 4.7945 6.4983 6.3874 8.2754 5.4366 15.3059 7.2339 8.2521 6.2079 5.2022 5.7798 5.5396 5.9596 7.4530 8.1826 7.3553 8.7031 3.2338 3.6188 4.2926 4.0622 5.9117 4.3447 5.5408 3.5739 4.4265 3.7585 8.3628 5.4652 4.4940 1.3187 3.8624 4.7035 1.3804 1.4737 2.8024 1.4371 2.4559 2.5615 1.5176 3.0459 3.6794 1.9807 1.5185 3.3544 7.1766 1.3340 1.3889 1.4086 3.6946 6.7401 2.1870 1.8115 1.9451 1.8476 1.9578 1.8854 1.3655 1.9170 1.1312 1.8651 1.9030 2.5906 4.4223 1.9429 2.5328 1.4847 1.6199 1.6434 3.6890 3.4939 2.7212 6.4549 2.2070 2.8576 4.4056 2.8397 2.4468 4.1261 6.0912 7.4506 7.6689 6.9608 8.5563 1.0832 1.0862 1.0907 1.0891 1.0950 1.0937 1.0999 1.0979 1.0989 1.0926 1.0973 1.1077
irintensity: 0.8857 0.3559 1.9757 0.1690 0.1678 0.5286 0.3249 0.1277 1.4856 0.1974 2.6765 2.0927 4.5528 0.4532 1.2509 1.3815 0.9691 2.7195 4.5725 5.7054 6.1930 2.6383 18.8307 1.1135 0.1810 4.3468 3.5938 9.3588 4.8657 21.9602 34.7880 24.2571 14.8426 20.5064 1.7791 15.4977 80.6062 67.2484 9.3069 47.4421 13.0385 26.5700 0.4742 12.4607 15.4074 6.5907 33.0620 40.3596 15.0787 0.9195 1.3009 0.4525 22.8337 39.2592 11.0079 59.3044 14.7128 13.5274 19.7392 6.8441 36.5187 45.6036 0.8421 1.5129 54.5215 20.3143 39.6060 16.6015 10.3495 7.1553 5.9046 1.9811 2.7516 13.7417 11.5248 16.9030 28.4470 40.6999 7.6714 75.4075 34.1587 7.4511 12.3065 8.7192 16.1011 3.2087 10.9685 6.9182 2.2993 6.1466 0.1709 4.4883 0.5000 13.5462 1.2924 3.3362 5.1399 0.2162 1.5370
temp: 298.150 k
press: 1.00000 atm
elementType: 17 17 8 7 7 6 6 6 6 6 6 6 6 6 6 6 6 6 6 6 6 6 6 1 1 1 1 1 1 1 1 1 1 1 1
symmnumber: 1
zpe: 663383.2 jmol-1
zpe.correction: 0.252669 hartree
zpe.thermalcorrener: 0.271660 hartree
zpe.thermalcorrenthalpy: 0.272604 hartree
zpe.thermalcorrgfe: 0.201017 hartree
zpe.sumelectzpe: -1796.357186 hartree
zpe.sumelectthermal: -1796.338196 hartree
zpe.sumelectthermalent: -1796.337251 hartree
zpe.sumelectthermalfe: -1796.408839 hartree
dipole: 0.0410 -5.2801 0.9987
dipole: 5.3739
quadrupole: -158.1871 -161.5606 -130.5450
quadrupole: -18.4670 -0.9889 -3.9555
quadrupole: -8.0895 -11.4630 19.5526 -18.4670 -0.9889 -3.9555
hfenergy: -1796.6098553 hartree
pointgroup: C01 [X(C18H12Cl2N2O1)]
dipole: -0.06802 2.0376757 0.5597109 debye
polarizability: 300.939568|5.5189853|180.2093206|11.6612357|13.403881|200.8895201 unknown
InChI: InChI=1S/C18H12Cl2N2O/c19-13-5-6-16-12(9-13)10-17(23-16)18(22-8-7-21-11-22)14-3-1-2-4-15(14)20/h1-11,18H
charge 0 multiplicity 1
35 atoms
Cl -3.840681 0.390957 -2.156581
Cl 6.678313 0.709891 -0.55452
O  0.924174 -0.246763 0.721696
N  -1.572674 -1.556117 -0.246493
N  -2.143603 -3.749377 -0.320154
C  -1.123508 -0.220441 -0.723946
C  0.365267 -0.04575 -0.573376
C  -1.969805 0.90135 -0.106053
C  1.348771 0.263471 -1.491315
C  2.61614 0.272617 -0.7802
C  2.31412 -0.051039 0.575275
C  -3.224433 1.252811 -0.662117
C  -1.55075 1.61654 1.045969
C  -1.786475 -1.955703 1.081237
C  -1.798606 -2.675077 -1.052074
C  3.964079 0.511766 -1.147696
C  3.275419 -0.156249 1.588907
C  -4.043892 2.257222 -0.115112
C  -2.353962 2.629141 1.612415
C  -2.137897 -3.304232 1.015326
C  4.928272 0.410644 -0.130854
C  4.616706 0.084158 1.215041
C  -3.602698 2.94975 1.034534
H  -1.315828 -0.217825 -1.813125
H  1.190305 0.457977 -2.550412
H  -0.583536 1.371491 1.494454
H  -1.675677 -1.271893 1.91702
H  -1.709857 -2.646332 -2.13573
H  4.249066 0.762062 -2.172626
H  3.008029 -0.416312 2.616161
H  -5.005456 2.492913 -0.579628
H  -2.005788 3.165368 2.501123
H  -2.387497 -3.976786 1.832529
H  5.417192 0.017104 1.956654
H  -4.232931 3.73346 1.46747
