program: Orca
programVersion: 5.0.2
elementType: O O N N C C C C C C C C C H H H H H H H H H H H H H H H H H H H H
charge: 0
multiplicity: 1
keywords: wb97x-d3
keywords: def2-TZVPP
keywords: def2/J RIJCOSX
keywords: DEFGRID2
keywords: scfconv7
keywords: smallprint printgap noloewdin
keywords: NOSOSCF
formula: C9H20N2O2
InChI: InChI=1/C9H20N2O2/c1-4-8-13-9(12)10-6-5-7-11(2)3/h10H,4-8H2,1-3H3
33 atoms
O  -2.52095 -0.124835 0.063011
O  -1.144497 1.628312 0.401982
N  3.986194 -0.227079 -0.363554
N  -0.401148 -0.304084 -0.537878
C  1.730218 -0.250042 0.735678
C  3.171565 0.236134 0.750156
C  1.002146 0.052213 -0.566637
C  5.311327 0.349379 -0.264105
C  4.078807 -1.672722 -0.38585
C  -3.646292 0.632109 0.523861
C  -4.855477 -0.276141 0.511462
C  -1.333793 0.487245 0.012685
C  -5.214476 -0.813763 -0.865769
H  1.676138 -1.321568 0.94423
H  1.213728 0.245959 1.561758
H  3.621685 -0.049649 1.716406
H  3.169969 1.329559 0.72762
H  1.09566 1.10978 -0.817026
H  1.450061 -0.499631 -1.390983
H  -0.644037 -1.26379 -0.729891
H  5.252448 1.43861 -0.280117
H  5.923218 0.040545 -1.112512
H  5.844072 0.059115 0.654287
H  4.732257 -1.989137 -1.199673
H  3.104921 -2.129069 -0.563893
H  4.481442 -2.096917 0.547347
H  -3.808082 1.491628 -0.132091
H  -3.460712 1.004775 1.533471
H  -4.703942 -1.100349 1.213259
H  -5.688757 0.310047 0.905775
H  -5.364421 -0.002734 -1.580777
H  -4.440986 -1.469728 -1.265058
H  -6.138159 -1.391128 -0.825439
elementType: O N C H
totalener: -615.05977401 hartree
nucrepener: 830.04421552 hartree
electener: -1445.10398954 hartree
oneelecener: -2481.96680073 hartree
twoeener: 1036.86281120 hartree
cpcmener: -0.02682080 hartree
kineticenergy: 612.20391490 hartree
xcener: -59.909790994026 hartree
chargesum: 0.0000000
charge: -0.335676 -0.578889 -0.244423 -0.243081 -0.111972 -0.111732 -0.031564 -0.196416 -0.196197 0.017685 -0.100014 0.538437 -0.257338 0.076531 0.087304 0.086277 0.092200 0.092769 0.098215 0.178255 0.099296 0.100508 0.073429 0.100859 0.095138 0.082480 0.099817 0.106160 0.064548 0.066442 0.079420 0.080090 0.091443
qa: -0.3357 -0.5789 -0.2444 -0.2431 -0.1120 -0.1117 -0.0316 -0.1964 -0.1962 0.0177 -0.1000 0.5384 -0.2573 0.0765 0.0873 0.0863 0.0922 0.0928 0.0982 0.1783 0.0993 0.1005 0.0734 0.1009 0.0951 0.0825 0.0998 0.1062 0.0645 0.0664 0.0794 0.0801 0.0914
va: 2.0654 1.9168 2.8568 3.1978 3.8308 3.9154 3.8407 3.9302 3.9354 3.8470 3.9467 4.2722 3.9154 1.0108 1.0229 1.0085 1.0005 1.0195 1.0171 1.0135 0.9965 0.9959 1.0024 0.9969 0.9929 1.0042 0.9980 1.0031 1.0135 1.0117 1.0024 1.0103 1.0045
dispcorr: -0.011345424 hartree
energy: -615.071119437736
dipole: 6.64210 -6.55350 0.08860 -5.39641 3.78724 -1.60917 -0.09978 0.09056 -0.00922
magnitude: 1.61163 au
magnitude: 4.09644 debye
