program: Orca
programVersion: 5.0.2
elementType: O O N N C C C C C C C C C H H H H H H H H H H H H H H H H H H H H
charge: 0
multiplicity: 1
keywords: wb97x-d3
keywords: def2-TZVPP
keywords: def2/J RIJCOSX
keywords: DEFGRID2
keywords: scfconv7
keywords: smallprint printgap noloewdin
keywords: NOSOSCF
formula: C9H20N2O2
InChI: InChI=1/C9H20N2O2/c1-4-8-13-9(12)10-6-5-7-11(2)3/h10H,4-8H2,1-3H3
33 atoms
O  -2.47219 -0.009914 -0.265499
O  -1.073352 0.714743 1.348722
N  4.374915 -0.42408 0.26836
N  -0.429549 0.620784 -0.82811
C  1.890686 -0.059554 -0.194624
C  3.29711 0.512173 -0.007301
C  0.935216 1.050312 -0.612696
C  4.159178 -1.174837 1.487198
C  4.631308 -1.315102 -0.8436
C  -3.53035 -0.169521 0.687547
C  -4.758519 -0.654082 -0.049845
C  -1.30114 0.459218 0.176873
C  -5.274511 0.317967 -1.100316
H  1.889522 -0.839633 -0.960532
H  1.535106 -0.517431 0.732016
H  3.269751 1.243396 0.806457
H  3.570163 1.072565 -0.907044
H  0.941673 1.851983 0.127774
H  1.278436 1.496085 -1.546522
H  -0.692187 0.30959 -1.750388
H  3.327486 -1.891017 1.436756
H  3.961351 -0.495159 2.31741
H  5.056929 -1.742877 1.737121
H  3.826442 -2.035692 -1.044745
H  5.53779 -1.892666 -0.655009
H  4.795908 -0.73949 -1.755669
H  -3.736199 0.785248 1.178626
H  -3.236642 -0.889829 1.454323
H  -4.558956 -1.630321 -0.49904
H  -5.528715 -0.819488 0.707131
H  -5.466842 1.301943 -0.668633
H  -4.570286 0.447161 -1.922401
H  -6.210098 -0.039969 -1.530346
elementType: O N C H
totalener: -615.05933959 hartree
nucrepener: 827.20715469 hartree
electener: -1442.26649428 hartree
oneelecener: -2476.22332864 hartree
twoeener: 1033.95683436 hartree
cpcmener: -0.02788194 hartree
kineticenergy: 612.20182627 hartree
xcener: -59.911749327739 hartree
chargesum: 0.0000000
charge: -0.336626 -0.580152 -0.248111 -0.238768 -0.100583 -0.092241 -0.055422 -0.209424 -0.203821 0.016140 -0.099294 0.543763 -0.257873 0.073080 0.075577 0.091430 0.087103 0.093434 0.105493 0.181097 0.080824 0.102061 0.102364 0.079169 0.100681 0.100904 0.097592 0.108728 0.064711 0.066864 0.079334 0.080285 0.091680
qa: -0.3366 -0.5802 -0.2481 -0.2388 -0.1006 -0.0922 -0.0554 -0.2094 -0.2038 0.0161 -0.0993 0.5438 -0.2579 0.0731 0.0756 0.0914 0.0871 0.0934 0.1055 0.1811 0.0808 0.1021 0.1024 0.0792 0.1007 0.1009 0.0976 0.1087 0.0647 0.0669 0.0793 0.0803 0.0917
va: 2.0655 1.9154 2.8927 3.1946 3.7546 3.9297 3.8922 3.9420 3.9427 3.8480 3.9454 4.2606 3.9155 1.0164 1.0206 1.0019 1.0023 1.0154 1.0046 1.0123 0.9920 0.9929 0.9949 0.9933 0.9940 0.9943 0.9993 1.0021 1.0134 1.0111 1.0025 1.0098 1.0044
dispcorr: -0.011277033 hartree
energy: -615.070616625089
dipole: 4.23624 -4.75149 -0.51525 -4.35916 3.76719 -0.59197 -2.68398 1.13550 -1.54849
magnitude: 1.73601 au
magnitude: 4.41258 debye
