program: Orca
programVersion: 5.0.2
elementType: O O N N C C C C C C C C C H H H H H H H H H H H H H H H H H H H H
charge: 0
multiplicity: 1
keywords: wb97x-d3
keywords: def2-TZVPP
keywords: def2/J RIJCOSX
keywords: DEFGRID2
keywords: scfconv7
keywords: smallprint printgap noloewdin
keywords: NOSOSCF
formula: C9H20N2O2
InChI: InChI=1/C9H20N2O2/c1-4-8-13-9(12)10-6-5-7-11(2)3/h10H,4-8H2,1-3H3
33 atoms
O  -2.54861 -0.361548 0.678881
O  -1.36933 -0.127794 -1.233531
N  4.094999 -0.794388 -0.175093
N  -0.582917 0.649551 0.750168
C  1.720138 -0.177689 0.314105
C  3.076124 0.244674 -0.228136
C  0.739832 0.98704 0.270432
C  4.492629 -1.060792 1.194365
C  5.256297 -0.367026 -0.932047
C  -3.68905 -0.861603 -0.030682
C  -4.53932 0.242451 -0.628254
C  -1.486129 0.035619 -0.030117
C  -4.99823 1.277579 0.388331
H  1.329364 -1.009771 -0.27721
H  1.798787 -0.525599 1.346819
H  3.413236 1.153604 0.300993
H  2.94842 0.533641 -1.275074
H  1.11023 1.805303 0.888478
H  0.657469 1.380924 -0.743062
H  -0.724563 0.629857 1.74866
H  3.65915 -1.441486 1.782978
H  4.885568 -0.170345 1.708801
H  5.271095 -1.824079 1.214168
H  4.98979 -0.201111 -1.976574
H  6.026312 -1.138963 -0.908013
H  5.706238 0.562269 -0.550494
H  -4.257167 -1.407016 0.723198
H  -3.380925 -1.579085 -0.793189
H  -4.008176 0.729527 -1.449114
H  -5.408657 -0.245472 -1.076977
H  -4.161045 1.835442 0.809406
H  -5.668253 2.003045 -0.073691
H  -5.538678 0.812394 1.21515
elementType: O N C H
totalener: -615.06026049 hartree
nucrepener: 829.77961249 hartree
electener: -1444.83987298 hartree
oneelecener: -2481.50314553 hartree
twoeener: 1036.66327256 hartree
cpcmener: -0.02800488 hartree
kineticenergy: 612.20323435 hartree
xcener: -59.908801642127 hartree
chargesum: -0.0000000
charge: -0.344300 -0.575576 -0.234161 -0.246484 -0.073595 -0.124262 -0.038692 -0.197769 -0.195166 0.022463 -0.106597 0.533488 -0.265001 0.064033 0.071352 0.073776 0.093073 0.105521 0.091309 0.178704 0.102154 0.077420 0.101391 0.099190 0.100770 0.075989 0.111435 0.102503 0.066501 0.075893 0.080354 0.093374 0.080909
qa: -0.3443 -0.5756 -0.2342 -0.2465 -0.0736 -0.1243 -0.0387 -0.1978 -0.1952 0.0225 -0.1066 0.5335 -0.2650 0.0640 0.0714 0.0738 0.0931 0.1055 0.0913 0.1787 0.1022 0.0774 0.1014 0.0992 0.1008 0.0760 0.1114 0.1025 0.0665 0.0759 0.0804 0.0934 0.0809
va: 2.0559 1.9186 2.8961 3.1979 3.7684 3.9596 3.8817 3.9280 3.9284 3.8503 3.8637 4.2843 3.9252 1.0349 1.0242 1.0081 1.0007 1.0043 1.0182 1.0139 0.9941 1.0055 0.9944 0.9968 0.9947 1.0026 0.9969 1.0170 1.0224 1.0132 1.0093 1.0042 1.0012
dispcorr: -0.011311336 hartree
energy: -615.071571821973
dipole: 7.86501 -7.70253 0.16247 2.18617 -1.59222 0.59395 1.88553 -0.29920 1.58633
magnitude: 1.70165 au
magnitude: 4.32526 debye
