program: Orca
programVersion: 5.0.2
elementType: O O N N C C C C C C C C C H H H H H H H H H H H H H H H H H H H H
charge: 0
multiplicity: 1
keywords: wb97x-d3
keywords: def2-TZVPP
keywords: def2/J RIJCOSX
keywords: DEFGRID2
keywords: scfconv7
keywords: smallprint printgap noloewdin
keywords: NOSOSCF
formula: C9H20N2O2
InChI: InChI=1/C9H20N2O2/c1-4-8-13-9(12)10-6-5-7-11(2)3/h10H,4-8H2,1-3H3
33 atoms
O  -2.608491 1.057651 -0.82597
O  -1.41269 1.085123 1.096538
N  3.741287 -1.288445 -0.032318
N  -0.417512 1.301367 -0.934971
C  1.554366 -0.115746 -0.387206
C  3.006998 -0.035084 0.057672
C  0.947982 1.280273 -0.45904
C  3.225462 -2.271128 0.899946
C  5.141537 -1.04483 0.253126
C  -3.85505 0.880705 -0.141467
C  -4.307682 -0.564662 -0.154542
C  -1.471927 1.132943 -0.121453
C  -3.415928 -1.523477 0.619377
H  1.494551 -0.583411 -1.373399
H  0.962397 -0.727554 0.29821
H  3.047771 0.37695 1.081398
H  3.519213 0.69072 -0.581274
H  0.989695 1.764835 0.516179
H  1.536613 1.901975 -1.134746
H  -0.565332 1.208407 -1.928632
H  3.808242 -3.190027 0.83003
H  2.192937 -2.530084 0.669193
H  3.261209 -1.933302 1.946975
H  5.712911 -1.968983 0.156652
H  5.317854 -0.649452 1.265456
H  5.554555 -0.328065 -0.45777
H  -4.56932 1.500374 -0.684187
H  -3.79268 1.263704 0.877918
H  -5.313796 -0.575332 0.272899
H  -4.414352 -0.903414 -1.188268
H  -3.851639 -2.522895 0.629431
H  -2.423688 -1.613298 0.175312
H  -3.293493 -1.208589 1.656486
elementType: O N C H
totalener: -615.06007890 hartree
nucrepener: 839.30823924 hartree
electener: -1454.36831814 hartree
oneelecener: -2500.57384874 hartree
twoeener: 1046.20553060 hartree
cpcmener: -0.02701970 hartree
kineticenergy: 612.19548321 hartree
xcener: -59.908101176228 hartree
chargesum: 0.0000000
charge: -0.339844 -0.572949 -0.231846 -0.236516 -0.063431 -0.122892 -0.043560 -0.199410 -0.192927 0.022383 -0.081865 0.526497 -0.277271 0.061483 0.071812 0.072559 0.086720 0.090384 0.104956 0.177266 0.101771 0.100041 0.078083 0.100557 0.076028 0.098682 0.108101 0.094898 0.066359 0.063378 0.095786 0.081759 0.083009
qa: -0.3398 -0.5729 -0.2318 -0.2365 -0.0634 -0.1229 -0.0436 -0.1994 -0.1929 0.0224 -0.0819 0.5265 -0.2773 0.0615 0.0718 0.0726 0.0867 0.0904 0.1050 0.1773 0.1018 0.1000 0.0781 0.1006 0.0760 0.0987 0.1081 0.0949 0.0664 0.0634 0.0958 0.0818 0.0830
va: 2.0661 1.9192 2.8970 3.2014 3.7998 3.9553 3.8860 3.9291 3.9285 3.8593 3.8761 4.2960 3.9367 1.0294 1.0241 1.0072 1.0012 1.0178 1.0045 1.0148 0.9947 0.9948 1.0042 0.9946 1.0037 0.9967 0.9996 1.0174 1.0142 1.0125 1.0058 1.0009 1.0054
dispcorr: -0.011659712 hartree
energy: -615.071738610523
dipole: 8.42686 -8.32745 0.09941 -9.09595 9.06615 -0.02981 2.77590 -3.86855 -1.09266
magnitude: 1.09758 au
magnitude: 2.78981 debye
