program: Orca
programVersion: 5.0.2
elementType: O O N N C C C C C C C C C H H H H H H H H H H H H H H H H H H H H
charge: 0
multiplicity: 1
keywords: wb97x-d3
keywords: def2-TZVPP
keywords: def2/J RIJCOSX
keywords: DEFGRID2
keywords: scfconv7
keywords: smallprint printgap noloewdin
keywords: NOSOSCF
formula: C9H20N2O2
InChI: InChI=1/C9H20N2O2/c1-4-8-13-9(12)10-6-5-7-11(2)3/h10H,4-8H2,1-3H3
33 atoms
O  -2.585884 1.019974 -0.843651
O  -1.348166 1.073282 1.050139
N  3.721001 -1.256889 0.003935
N  -0.406469 1.342968 -0.997676
C  1.561502 -0.069755 -0.434453
C  2.990289 -0.001002 0.082147
C  0.966622 1.328609 -0.54314
C  3.134825 -2.263002 0.867657
C  5.100259 -1.034895 0.389945
C  -3.815284 0.840995 -0.128544
C  -4.255945 -0.608024 -0.107996
C  -1.437546 1.128709 -0.165086
C  -3.35959 -1.542505 0.690556
H  1.543402 -0.54395 -1.41903
H  0.935056 -0.673067 0.227125
H  2.978367 0.388613 1.115018
H  3.538138 0.735511 -0.512968
H  1.027883 1.845038 0.415121
H  1.547459 1.922786 -1.248828
H  -0.571114 1.259995 -1.9892
H  3.085881 -1.951832 1.922672
H  3.723968 -3.179416 0.821293
H  2.12433 -2.516492 0.548972
H  5.211392 -0.67671 1.424796
H  5.563314 -0.296899 -0.266333
H  5.67118 -1.959663 0.298918
H  -4.547242 1.444701 -0.665234
H  -3.735029 1.240967 0.883125
H  -5.26259 -0.615807 0.31815
H  -4.358837 -0.97148 -1.133651
H  -3.241349 -1.201255 1.719813
H  -3.790241 -2.5436 0.724494
H  -2.365642 -1.637793 0.251327
elementType: O N C H
totalener: -615.06009323 hartree
nucrepener: 841.33505162 hartree
electener: -1456.39514486 hartree
oneelecener: -2504.65968539 hartree
twoeener: 1048.26454054 hartree
cpcmener: -0.02694333 hartree
kineticenergy: 612.20394314 hartree
xcener: -59.909533837013 hartree
chargesum: -0.0000000
charge: -0.338912 -0.573116 -0.231594 -0.238913 -0.066212 -0.123017 -0.043622 -0.200389 -0.192787 0.023393 -0.082986 0.528267 -0.276271 0.063125 0.071866 0.072095 0.086391 0.091649 0.105860 0.177122 0.078688 0.101893 0.099880 0.075710 0.098894 0.100476 0.108519 0.094367 0.066777 0.063170 0.083054 0.095535 0.081087
qa: -0.3389 -0.5731 -0.2316 -0.2389 -0.0662 -0.1230 -0.0436 -0.2004 -0.1928 0.0234 -0.0830 0.5283 -0.2763 0.0631 0.0719 0.0721 0.0864 0.0916 0.1059 0.1771 0.0787 0.1019 0.0999 0.0757 0.0989 0.1005 0.1085 0.0944 0.0668 0.0632 0.0831 0.0955 0.0811
va: 2.0679 1.9180 2.8954 3.2039 3.7930 3.9535 3.8865 3.9299 3.9292 3.8581 3.8772 4.2948 3.9374 1.0290 1.0246 1.0074 1.0010 1.0164 1.0047 1.0148 1.0038 0.9949 0.9946 1.0038 0.9963 0.9948 0.9996 1.0174 1.0138 1.0126 1.0051 1.0059 1.0009
dispcorr: -0.011712275 hartree
energy: -615.071805508319
dipole: 8.15073 -8.11973 0.03100 -9.08634 9.07243 -0.01391 3.15409 -4.23606 -1.08197
magnitude: 1.08251 au
magnitude: 2.75152 debye
