program: Orca
programVersion: 5.0.2
elementType: O O N N C C C C C C C C C H H H H H H H H H H H H H H H H H H H H
charge: 0
multiplicity: 1
keywords: wb97x-d3
keywords: def2-TZVPP
keywords: def2/J RIJCOSX
keywords: DEFGRID2
keywords: scfconv7
keywords: smallprint printgap noloewdin
keywords: NOSOSCF
formula: C9H20N2O2
InChI: InChI=1/C9H20N2O2/c1-4-8-13-9(12)10-6-5-7-11(2)3/h10H,4-8H2,1-3H3
33 atoms
O  -2.413818 0.933014 -1.008076
O  -1.43261 0.927029 1.02743
N  3.742038 -1.267628 0.58499
N  -0.246207 1.340384 -0.866429
C  1.689538 -0.051971 -0.167423
C  3.04139 0.008053 0.52656
C  1.060785 1.332985 -0.24494
C  4.872411 -1.155152 1.486142
C  4.22046 -1.65804 -0.72743
C  -3.69893 0.659353 -0.439017
C  -3.912346 -0.811303 -0.140123
C  -1.3645 1.047292 -0.184573
C  -5.327785 -1.053066 0.363217
H  1.783889 -0.445824 -1.182196
H  1.024229 -0.725708 0.378184
H  2.881596 0.349042 1.553434
H  3.667586 0.778871 0.042639
H  0.98216 1.774806 0.748427
H  1.700835 1.996943 -0.825776
H  -0.2820 1.301608 -1.873698
H  4.533291 -0.906556 2.492348
H  5.598239 -0.38637 1.17884
H  5.40468 -2.105654 1.544453
H  4.902882 -0.918408 -1.173696
H  3.396346 -1.807493 -1.422823
H  4.757413 -2.604416 -0.662299
H  -4.409439 0.993208 -1.195528
H  -3.861004 1.269263 0.452271
H  -3.736541 -1.395061 -1.046942
H  -3.19306 -1.154691 0.605797
H  -5.490776 -2.108476 0.578397
H  -5.526047 -0.496788 1.280577
H  -6.071457 -0.748682 -0.374886
elementType: O N C H
totalener: -615.06049832 hartree
nucrepener: 825.18035238 hartree
electener: -1440.24085071 hartree
oneelecener: -2472.27484677 hartree
twoeener: 1032.03399606 hartree
cpcmener: -0.02771116 hartree
kineticenergy: 612.20404496 hartree
xcener: -59.908956435958 hartree
chargesum: 0.0000000
charge: -0.341603 -0.576954 -0.235077 -0.242225 -0.072379 -0.123831 -0.038540 -0.193109 -0.196667 0.034356 -0.092940 0.532627 -0.273620 0.071224 0.063333 0.093173 0.073521 0.091291 0.104492 0.176996 0.098531 0.075428 0.100312 0.077169 0.101885 0.101188 0.110577 0.090326 0.063947 0.065586 0.093713 0.084340 0.082932
qa: -0.3416 -0.5770 -0.2351 -0.2422 -0.0724 -0.1238 -0.0385 -0.1931 -0.1967 0.0344 -0.0929 0.5326 -0.2736 0.0712 0.0633 0.0932 0.0735 0.0913 0.1045 0.1770 0.0985 0.0754 0.1003 0.0772 0.1019 0.1012 0.1106 0.0903 0.0639 0.0656 0.0937 0.0843 0.0829
va: 2.0729 1.9143 2.8951 3.2068 3.7748 3.9568 3.8840 3.9282 3.9277 3.8415 3.8627 4.2808 3.9466 1.0241 1.0335 1.0008 1.0085 1.0182 1.0041 1.0150 0.9970 1.0025 0.9947 1.0057 0.9939 0.9947 0.9997 1.0146 1.0121 1.0244 1.0023 1.0010 1.0016
dispcorr: -0.010942564 hartree
energy: -615.071440886710
dipole: 7.27371 -6.73492 0.53879 -7.17609 7.37146 0.19536 0.71399 -2.29022 -1.57623
magnitude: 1.67719 au
magnitude: 4.26307 debye
