program: Orca
programVersion: 5.0.2
elementType: O O N N C C C C C C C C C H H H H H H H H H H H H H H H H H H H H
charge: 0
multiplicity: 1
keywords: wb97x-d3
keywords: def2-TZVPP
keywords: def2/J RIJCOSX
keywords: DEFGRID2
keywords: scfconv7
keywords: smallprint printgap noloewdin
keywords: NOSOSCF
formula: C9H20N2O2
InChI: InChI=1/C9H20N2O2/c1-4-8-13-9(12)10-6-5-7-11(2)3/h10H,4-8H2,1-3H3
33 atoms
O  -2.193668 0.583705 -0.935411
O  -1.511683 1.795071 0.844654
N  3.464726 -1.114764 0.322818
N  -0.103136 1.297281 -0.868448
C  1.906451 0.835132 0.540299
C  2.486238 -0.263266 -0.339039
C  1.093814 1.842885 -0.263257
C  4.04042 -2.020775 -0.651932
C  2.857382 -1.883264 1.392051
C  -3.52083 0.474427 -0.404389
C  -3.655808 -0.612354 0.642783
C  -1.280491 1.256305 -0.225454
C  -3.259678 -1.993787 0.145981
H  1.280018 0.424375 1.335953
H  2.72005 1.380541 1.025275
H  2.986335 0.210734 -1.189078
H  1.667332 -0.869339 -0.764135
H  0.811506 2.682314 0.369836
H  1.70897 2.255593 -1.064429
H  0.004396 0.730356 -1.695715
H  3.299406 -2.689818 -1.116093
H  4.801137 -2.646531 -0.183334
H  4.524459 -1.458861 -1.451818
H  3.600784 -2.541312 1.843324
H  2.019995 -2.511725 1.051378
H  2.484672 -1.23357 2.183053
H  -4.138384 0.236292 -1.270796
H  -3.855731 1.438054 -0.016742
H  -3.085462 -0.353553 1.537085
H  -4.706464 -0.618168 0.945103
H  -3.845369 -2.284928 -0.728033
H  -2.205336 -2.043035 -0.128884
H  -3.426942 -2.744716 0.918446
elementType: O N C H
totalener: -615.05955124 hartree
nucrepener: 852.86536238 hartree
electener: -1467.92491361 hartree
oneelecener: -2527.41008577 hartree
twoeener: 1059.48517216 hartree
cpcmener: -0.02714220 hartree
kineticenergy: 612.20220236 hartree
xcener: -59.908995614733 hartree
chargesum: -0.0000000
charge: -0.344012 -0.576293 -0.230403 -0.236055 -0.071404 -0.117223 -0.069688 -0.193428 -0.201371 0.021818 -0.109847 0.537193 -0.261980 0.070351 0.068474 0.089443 0.072052 0.098037 0.108374 0.180717 0.075075 0.100685 0.098980 0.101741 0.078521 0.101184 0.110617 0.104073 0.066243 0.075728 0.080678 0.079107 0.092615
qa: -0.3440 -0.5763 -0.2304 -0.2361 -0.0714 -0.1172 -0.0697 -0.1934 -0.2014 0.0218 -0.1098 0.5372 -0.2620 0.0704 0.0685 0.0894 0.0721 0.0980 0.1084 0.1807 0.0751 0.1007 0.0990 0.1017 0.0785 0.1012 0.1106 0.1041 0.0662 0.0757 0.0807 0.0791 0.0926
va: 2.0538 1.9179 2.9007 3.1902 3.7833 3.9295 3.9197 3.9269 3.9312 3.8509 3.8666 4.2818 3.9248 1.0229 1.0284 1.0002 1.0156 1.0211 1.0011 1.0123 1.0042 0.9954 0.9964 0.9942 1.0044 0.9941 0.9975 1.0153 1.0229 1.0132 1.0011 1.0096 1.0041
dispcorr: -0.011840108 hartree
energy: -615.071391345111
dipole: 5.94658 -5.79196 0.15462 -11.76727 10.76405 -1.00322 1.24020 -2.50644 -1.26625
magnitude: 1.62288 au
magnitude: 4.12503 debye
