program: Orca
programVersion: 5.0.2
elementType: O O N N C C C C C C C C C H H H H H H H H H H H H H H H H H H H H
charge: 0
multiplicity: 1
keywords: wb97x-d3
keywords: def2-TZVPP
keywords: def2/J RIJCOSX
keywords: DEFGRID2
keywords: scfconv7
keywords: smallprint printgap noloewdin
keywords: NOSOSCF
formula: C9H20N2O2
InChI: InChI=1/C9H20N2O2/c1-4-8-13-9(12)10-6-5-7-11(2)3/h10H,4-8H2,1-3H3
33 atoms
O  -2.184923 0.565822 0.094732
O  -0.691031 1.120834 -1.498767
N  3.053864 -1.358475 0.321299
N  -0.27433 1.48287 0.710978
C  2.135713 0.88405 0.922383
C  2.140226 -0.286417 -0.047837
C  1.092179 1.941892 0.583897
C  4.43458 -0.918223 0.270532
C  2.87115 -2.47535 -0.585142
C  -3.115007 0.113987 -0.897243
C  -4.335745 -0.419861 -0.18216
C  -1.013947 1.056058 -0.323658
C  -4.062623 -1.645296 0.676989
H  1.965871 0.523821 1.940876
H  3.105584 1.386538 0.925148
H  2.358353 0.089443 -1.062822
H  1.138437 -0.720796 -0.089225
H  1.222178 2.794205 1.250889
H  1.242344 2.318188 -0.427178
H  -0.61492 1.30049 1.642927
H  5.097497 -1.754611 0.493915
H  4.63256 -0.148452 1.015222
H  4.724288 -0.516932 -0.712881
H  3.088486 -2.225164 -1.634582
H  1.843085 -2.836428 -0.538785
H  3.523282 -3.302326 -0.301899
H  -2.659818 -0.668938 -1.509235
H  -3.38894 0.942976 -1.553697
H  -4.78764 0.374592 0.417384
H  -5.066142 -0.670209 -0.95513
H  -3.378352 -1.429298 1.497722
H  -4.986115 -2.022214 1.116858
H  -3.627731 -2.452128 0.084168
elementType: O N C H
totalener: -615.06093980 hartree
nucrepener: 850.11087692 hartree
electener: -1465.17181671 hartree
oneelecener: -2522.17412765 hartree
twoeener: 1057.00231093 hartree
cpcmener: -0.02725667 hartree
kineticenergy: 612.20584076 hartree
xcener: -59.910096326670 hartree
chargesum: -0.0000000
charge: -0.336402 -0.574171 -0.228628 -0.234628 -0.059999 -0.129840 -0.059090 -0.199368 -0.193767 0.016816 -0.099466 0.531603 -0.256100 0.063284 0.072908 0.068815 0.090978 0.109952 0.097858 0.176040 0.100568 0.100776 0.078733 0.076764 0.098356 0.100481 0.098444 0.108344 0.064086 0.066381 0.079619 0.091494 0.079160
qa: -0.3364 -0.5742 -0.2286 -0.2346 -0.0600 -0.1298 -0.0591 -0.1994 -0.1938 0.0168 -0.0995 0.5316 -0.2561 0.0633 0.0729 0.0688 0.0910 0.1100 0.0979 0.1760 0.1006 0.1008 0.0787 0.0768 0.0984 0.1005 0.0984 0.1083 0.0641 0.0664 0.0796 0.0915 0.0792
va: 2.0632 1.9219 2.9079 3.1841 3.7692 3.9613 3.9022 3.9282 3.9293 3.8439 3.9473 4.2841 3.9151 1.0281 1.0204 1.0113 1.0007 1.0024 1.0183 1.0138 0.9947 0.9945 1.0036 1.0035 0.9973 0.9951 0.9995 1.0021 1.0139 1.0111 1.0102 1.0044 1.0025
dispcorr: -0.011663175 hartree
energy: -615.072602974424
dipole: 5.05363 -5.21650 -0.16287 -8.29717 8.30188 0.00471 1.62291 -0.49427 1.12864
magnitude: 1.14034 au
magnitude: 2.89852 debye
