program: Orca
programVersion: 5.0.2
elementType: O O N N C C C C C C C C C H H H H H H H H H H H H H H H H H H H H
charge: 0
multiplicity: 1
keywords: wb97x-d3
keywords: def2-TZVPP
keywords: def2/J RIJCOSX
keywords: DEFGRID2
keywords: scfconv7
keywords: smallprint printgap noloewdin
keywords: NOSOSCF
formula: C9H20N2O2
InChI: InChI=1/C9H20N2O2/c1-4-8-13-9(12)10-6-5-7-11(2)3/h10H,4-8H2,1-3H3
33 atoms
O  -2.019506 -0.594067 -0.106491
O  -1.373678 1.327696 -1.103866
N  3.941709 -0.592348 0.010335
N  -0.310827 0.525442 0.738606
C  2.008433 0.997738 -0.051789
C  2.671121 -0.20292 0.606291
C  0.785949 1.470775 0.72501
C  3.759433 -1.080357 -1.343516
C  4.544633 -1.635918 0.816282
C  -3.211813 -0.659837 -0.898981
C  -4.332462 0.188878 -0.331517
C  -1.239512 0.48754 -0.229663
C  -4.691949 -0.158613 1.105072
H  2.718458 1.827517 -0.092141
H  1.712953 0.781017 -1.081367
H  1.970188 -1.055466 0.618154
H  2.86124 0.048656 1.653888
H  1.061491 1.669028 1.761741
H  0.427189 2.414216 0.317454
H  -0.232906 -0.274374 1.348324
H  3.386804 -0.295664 -2.000785
H  3.061421 -1.929743 -1.406507
H  4.715982 -1.410084 -1.750212
H  4.712004 -1.280112 1.833731
H  5.513381 -1.919782 0.403515
H  3.930384 -2.547038 0.879202
H  -3.490997 -1.713482 -0.881371
H  -2.999179 -0.391935 -1.93526
H  -4.082006 1.249112 -0.412927
H  -5.20029 0.031934 -0.977471
H  -5.541881 0.433324 1.445188
H  -4.964299 -1.21113 1.203452
H  -3.867974 0.037272 1.791973
elementType: O N C H
totalener: -615.05970617 hartree
nucrepener: 844.60660022 hartree
electener: -1459.66630639 hartree
oneelecener: -2510.92230807 hartree
twoeener: 1051.25600168 hartree
cpcmener: -0.02718445 hartree
kineticenergy: 612.20392496 hartree
xcener: -59.909173376625 hartree
chargesum: 0.0000000
charge: -0.345460 -0.573881 -0.231782 -0.236688 -0.071607 -0.117609 -0.067054 -0.200995 -0.192846 0.023143 -0.107164 0.532318 -0.264174 0.069294 0.070784 0.071431 0.090005 0.108020 0.097681 0.180820 0.101666 0.078265 0.101471 0.098811 0.100470 0.075150 0.110865 0.102019 0.067446 0.075992 0.093149 0.080745 0.079714
qa: -0.3455 -0.5739 -0.2318 -0.2367 -0.0716 -0.1176 -0.0671 -0.2010 -0.1928 0.0231 -0.1072 0.5323 -0.2642 0.0693 0.0708 0.0714 0.0900 0.1080 0.0977 0.1808 0.1017 0.0783 0.1015 0.0988 0.1005 0.0751 0.1109 0.1020 0.0674 0.0760 0.0931 0.0807 0.0797
va: 2.0518 1.9219 2.9006 3.1837 3.7764 3.9312 3.9192 3.9302 3.9275 3.8494 3.8662 4.2888 3.9246 1.0283 1.0249 1.0157 1.0010 1.0012 1.0212 1.0121 0.9936 1.0048 0.9942 0.9965 0.9951 1.0038 0.9970 1.0176 1.0218 1.0134 1.0041 1.0012 1.0098
dispcorr: -0.011719383 hartree
energy: -615.071425552622
dipole: 4.72689 -4.72571 0.00118 -4.99419 3.78643 -1.20776 2.67288 -1.57102 1.10186
magnitude: 1.63487 au
magnitude: 4.15550 debye
