program: Orca
programVersion: 5.0.2
elementType: O O N N C C C C C C C C C H H H H H H H H H H H H H H H H H H H H
charge: 0
multiplicity: 1
keywords: wb97x-d3
keywords: def2-TZVPP
keywords: def2/J RIJCOSX
keywords: DEFGRID2
keywords: scfconv7
keywords: smallprint printgap noloewdin
keywords: NOSOSCF
formula: C9H20N2O2
InChI: InChI=1/C9H20N2O2/c1-4-8-13-9(12)10-6-5-7-11(2)3/h10H,4-8H2,1-3H3
33 atoms
O  -1.998355 -0.599754 -0.069135
O  -1.347709 1.278872 -1.141196
N  3.9123 -0.601852 0.003223
N  -0.317061 0.573817 0.758102
C  1.996856 1.00761 -0.072095
C  2.646933 -0.193443 0.597576
C  0.786789 1.5102 0.705286
C  3.718714 -1.111752 -1.340641
C  4.512637 -1.634873 0.824652
C  -3.183404 -0.703275 -0.868141
C  -4.310585 0.163642 -0.34471
C  -1.223947 0.4809 -0.227066
C  -4.680194 -0.126628 1.101245
H  2.717912 1.827088 -0.127328
H  1.693767 0.781656 -1.097521
H  1.937513 -1.038974 0.616699
H  2.840435 0.065089 1.642938
H  1.075004 1.733148 1.73365
H  0.430454 2.445806 0.27735
H  -0.239733 -0.202198 1.398055
H  4.668547 -1.463113 -1.744111
H  3.355722 -0.333642 -2.011097
H  3.007881 -1.951127 -1.385413
H  5.476119 -1.933918 0.410615
H  3.891978 -2.540046 0.909694
H  4.69062 -1.260679 1.833392
H  -3.459106 -1.756231 -0.809315
H  -2.962626 -0.47744 -1.912451
H  -4.062417 1.2200 -0.466391
H  -5.172758 -0.021143 -0.990374
H  -5.531385 0.479322 1.412247
H  -4.95484 -1.173658 1.23908
H  -3.860545 0.094921 1.785159
elementType: O N C H
totalener: -615.05968615 hartree
nucrepener: 846.06583930 hartree
electener: -1461.12552546 hartree
oneelecener: -2513.84490123 hartree
twoeener: 1052.71937578 hartree
cpcmener: -0.02717975 hartree
kineticenergy: 612.21266873 hartree
xcener: -59.910646603320 hartree
chargesum: 0.0000000
charge: -0.345189 -0.572798 -0.231542 -0.239302 -0.072616 -0.118731 -0.066352 -0.200594 -0.192631 0.023774 -0.106770 0.531828 -0.263934 0.069335 0.070901 0.072095 0.090473 0.107769 0.098314 0.181336 0.101334 0.101384 0.078248 0.100380 0.075158 0.098798 0.111050 0.101837 0.067573 0.075688 0.092929 0.080818 0.079436
qa: -0.3452 -0.5728 -0.2315 -0.2393 -0.0726 -0.1187 -0.0664 -0.2006 -0.1926 0.0238 -0.1068 0.5318 -0.2639 0.0693 0.0709 0.0721 0.0905 0.1078 0.0983 0.1813 0.1013 0.1014 0.0782 0.1004 0.0752 0.0988 0.1111 0.1018 0.0676 0.0757 0.0929 0.0808 0.0794
va: 2.0516 1.9231 2.8996 3.1824 3.7706 3.9305 3.9211 3.9305 3.9274 3.8484 3.8667 4.2904 3.9247 1.0288 1.0255 1.0159 1.0008 1.0014 1.0199 1.0116 0.9943 0.9936 1.0049 0.9951 1.0037 0.9966 0.9968 1.0178 1.0217 1.0135 1.0041 1.0012 1.0100
dispcorr: -0.011773440 hartree
energy: -615.071459594636
dipole: 4.61286 -4.62296 -0.01011 -4.91771 3.75648 -1.16123 2.67777 -1.53203 1.14573
magnitude: 1.63134 au
magnitude: 4.14654 debye
