program: Orca
programVersion: 5.0.2
elementType: O O N N C C C C C C C C C H H H H H H H H H H H H H H H H H H H H
charge: 0
multiplicity: 1
keywords: wb97x-d3
keywords: def2-TZVPP
keywords: def2/J RIJCOSX
keywords: DEFGRID2
keywords: scfconv7
keywords: smallprint printgap noloewdin
keywords: NOSOSCF
formula: C9H20N2O2
InChI: InChI=1/C9H20N2O2/c1-4-8-13-9(12)10-6-5-7-11(2)3/h10H,4-8H2,1-3H3
33 atoms
O  -2.026912 0.321717 1.060473
O  -1.5513 1.539787 -0.78103
N  3.774196 -0.954436 -0.39838
N  0.011477 1.136535 0.821198
C  2.010154 0.806589 -0.638044
C  2.768362 -0.145157 0.274609
C  1.124632 1.767242 0.14454
C  3.163685 -1.894323 -1.317829
C  4.539465 -1.683029 0.594397
C  -3.397797 0.187799 0.669497
C  -3.622907 -0.914611 -0.345549
C  -1.208965 1.034303 0.275734
C  -5.108108 -1.068538 -0.638916
H  2.724545 1.405776 -1.208267
H  1.395744 0.267475 -1.363369
H  2.054673 -0.786388 0.821144
H  3.281025 0.453406 1.033494
H  1.720358 2.287008 0.897114
H  0.733882 2.535628 -0.519934
H  0.202706 0.613722 1.661975
H  2.645888 -1.377866 -2.125324
H  2.439938 -2.565806 -0.830926
H  3.932403 -2.515975 -1.777902
H  3.927378 -2.371815 1.196934
H  5.027804 -0.989784 1.280335
H  5.320092 -2.27305 0.112545
H  -3.78605 1.141745 0.306129
H  -3.923583 -0.046595 1.595496
H  -3.086323 -0.696459 -1.270851
H  -3.222496 -1.854016 0.043136
H  -5.532215 -0.147883 -1.04318
H  -5.282925 -1.858141 -1.36903
H  -5.668796 -1.322949 0.262039
elementType: O N C H
totalener: -615.05977787 hartree
nucrepener: 837.14218262 hartree
electener: -1452.20196049 hartree
oneelecener: -2495.96391129 hartree
twoeener: 1043.76195080 hartree
cpcmener: -0.02708884 hartree
kineticenergy: 612.20609073 hartree
xcener: -59.909926265344 hartree
chargesum: -0.0000000
charge: -0.342141 -0.579761 -0.231966 -0.229075 -0.070007 -0.112358 -0.068019 -0.200658 -0.192565 0.031841 -0.093277 0.534642 -0.273588 0.066567 0.070254 0.069154 0.089107 0.107738 0.096905 0.180003 0.101224 0.078427 0.101394 0.075203 0.098899 0.100122 0.090134 0.111312 0.065436 0.063970 0.084512 0.093482 0.083088
qa: -0.3421 -0.5798 -0.2320 -0.2291 -0.0700 -0.1124 -0.0680 -0.2007 -0.1926 0.0318 -0.0933 0.5346 -0.2736 0.0666 0.0703 0.0692 0.0891 0.1077 0.0969 0.1800 0.1012 0.0784 0.1014 0.0752 0.0989 0.1001 0.0901 0.1113 0.0654 0.0640 0.0845 0.0935 0.0831
va: 2.0697 1.9125 2.8997 3.1922 3.7945 3.9282 3.9126 3.9300 3.9270 3.8445 3.8612 4.2780 3.9458 1.0284 1.0226 1.0164 1.0009 1.0009 1.0235 1.0128 0.9936 1.0047 0.9944 1.0037 0.9966 0.9952 1.0143 0.9996 1.0252 1.0122 1.0007 1.0025 1.0017
dispcorr: -0.011238333 hartree
energy: -615.071016201646
dipole: 4.17461 -3.84354 0.33108 -9.37023 8.46303 -0.90720 -1.77902 3.13003 1.35101
magnitude: 1.66067 au
magnitude: 4.22109 debye
