program: Orca
programVersion: 5.0.2
elementType: O O N N C C C C C C C C C H H H H H H H H H H H H H H H H H H H H
charge: 0
multiplicity: 1
keywords: wb97x-d3
keywords: def2-TZVPP
keywords: def2/J RIJCOSX
keywords: DEFGRID2
keywords: scfconv7
keywords: smallprint printgap noloewdin
keywords: NOSOSCF
formula: C9H20N2O2
InChI: InChI=1/C9H20N2O2/c1-4-8-13-9(12)10-6-5-7-11(2)3/h10H,4-8H2,1-3H3
33 atoms
O  -1.718316 0.095248 0.873075
O  -1.480263 2.052327 -0.226252
N  2.241319 -1.018895 0.270304
N  0.256579 1.083514 0.89096
C  2.050573 1.239691 -0.823309
C  2.936281 0.074801 -0.400561
C  1.309423 1.906323 0.328063
C  3.207074 -1.953721 0.816217
C  1.351868 -1.714515 -0.640926
C  -3.10406 0.01475 0.519912
C  -3.330759 -0.535799 -0.874082
C  -1.008724 1.145298 0.439826
C  -2.718087 -1.909701 -1.098727
H  2.704477 1.985802 -1.281869
H  1.339737 0.946119 -1.600293
H  3.690884 0.458911 0.29179
H  3.486568 -0.293187 -1.282698
H  2.015023 2.147701 1.125294
H  0.879113 2.851636 0.003483
H  0.578412 0.180154 1.216493
H  3.856333 -1.450248 1.533561
H  3.847446 -2.412278 0.048008
H  2.694197 -2.758968 1.343657
H  1.883965 -2.164493 -1.493165
H  0.594053 -1.044678 -1.045911
H  0.830875 -2.515064 -0.11451
H  -3.586702 0.985873 0.642911
H  -3.532594 -0.660854 1.26079
H  -4.414208 -0.590555 -1.009087
H  -2.967318 0.167886 -1.625905
H  -2.988128 -2.297267 -2.081214
H  -1.628954 -1.885741 -1.050596
H  -3.068461 -2.627935 -0.354978
elementType: O N C H
totalener: -615.05750207 hartree
nucrepener: 892.01764284 hartree
electener: -1507.07514491 hartree
oneelecener: -2605.84382948 hartree
twoeener: 1098.76868457 hartree
cpcmener: -0.02305214 hartree
kineticenergy: 612.21083053 hartree
xcener: -59.912711051617 hartree
chargesum: 0.0000000
charge: -0.339098 -0.572070 -0.242981 -0.248443 -0.133999 -0.078417 -0.043227 -0.198484 -0.207337 0.018029 -0.107942 0.517616 -0.255302 0.086262 0.080934 0.092418 0.084298 0.101087 0.095649 0.177104 0.100158 0.079605 0.100663 0.094549 0.089684 0.109062 0.102606 0.110712 0.076356 0.065958 0.093833 0.067667 0.083050
qa: -0.3391 -0.5721 -0.2430 -0.2484 -0.1340 -0.0784 -0.0432 -0.1985 -0.2073 0.0180 -0.1079 0.5176 -0.2553 0.0863 0.0809 0.0924 0.0843 0.1011 0.0956 0.1771 0.1002 0.0796 0.1007 0.0945 0.0897 0.1091 0.1026 0.1107 0.0764 0.0660 0.0938 0.0677 0.0831
va: 2.0489 1.9259 2.8696 3.1390 3.8589 3.8842 3.8840 3.9214 3.9117 3.8538 3.8679 4.3104 3.9259 1.0177 1.0082 1.0010 1.0137 1.0031 1.0281 1.0594 0.9980 1.0024 0.9959 1.0086 0.9906 0.9946 1.0158 0.9974 1.0134 1.0226 1.0061 1.0084 1.0027
dispcorr: -0.014057249 hartree
energy: -615.071559320299
dipole: 5.95584 -4.85654 1.09930 -10.60457 9.18581 -1.41876 -5.14723 5.13726 -0.00997
magnitude: 1.79483 au
magnitude: 4.56210 debye
