program: Orca
programVersion: 5.0.2
elementType: O O N N C C C C C C C C C H H H H H H H H H H H H H H H H H H H H
charge: 0
multiplicity: 1
keywords: wb97x-d3
keywords: def2-TZVPP
keywords: def2/J RIJCOSX
keywords: DEFGRID2
keywords: scfconv7
keywords: smallprint printgap noloewdin
keywords: NOSOSCF
formula: C9H20N2O2
InChI: InChI=1/C9H20N2O2/c1-4-8-13-9(12)10-6-5-7-11(2)3/h10H,4-8H2,1-3H3
33 atoms
O  -2.026056 0.457126 -0.561803
O  -0.83274 1.156303 1.217947
N  3.185862 -1.35152 0.020826
N  -0.070445 1.42366 -0.911113
C  2.350588 0.873084 -0.751696
C  2.246158 -0.264128 0.252111
C  1.252317 1.916134 -0.589651
C  2.925831 -2.416651 0.96935
C  4.559096 -0.907351 0.160016
C  -3.077063 0.005669 0.29933
C  -4.136738 -0.647792 -0.559773
C  -0.955716 1.019007 0.011616
C  -5.292632 -1.143083 0.29594
H  3.303951 1.395432 -0.64354
H  2.322961 0.478987 -1.7716
H  1.243303 -0.69542 0.204817
H  2.357633 0.149578 1.269832
H  1.242602 2.308487 0.426394
H  1.465668 2.761639 -1.243997
H  -0.2473 1.179484 -1.874165
H  1.90156 -2.776167 0.863284
H  3.063194 -2.109654 2.017359
H  3.591734 -3.260085 0.783239
H  4.772788 -0.459566 1.14307
H  4.817087 -0.17359 -0.602577
H  5.235696 -1.752608 0.029265
H  -3.499104 0.851588 0.848563
H  -2.685889 -0.70899 1.027908
H  -4.504836 0.066864 -1.29972
H  -3.699453 -1.484063 -1.110593
H  -6.0574 -1.616458 -0.319053
H  -4.959902 -1.878305 1.030433
H  -5.767128 -0.324075 0.838772
elementType: O N C H
totalener: -615.06119053 hartree
nucrepener: 841.04496113 hartree
electener: -1456.10615167 hartree
oneelecener: -2503.96878154 hartree
twoeener: 1047.86262987 hartree
cpcmener: -0.02726301 hartree
kineticenergy: 612.20424024 hartree
xcener: -59.909740082271 hartree
chargesum: -0.0000000
charge: -0.333899 -0.573703 -0.227526 -0.231680 -0.060613 -0.130479 -0.055917 -0.194456 -0.201023 0.034017 -0.085289 0.523930 -0.277512 0.073560 0.064352 0.090728 0.068950 0.096437 0.109843 0.174802 0.098706 0.076850 0.100692 0.079115 0.100963 0.101220 0.095335 0.093026 0.064342 0.065075 0.094198 0.082798 0.083159
qa: -0.3339 -0.5737 -0.2275 -0.2317 -0.0606 -0.1305 -0.0559 -0.1945 -0.2010 0.0340 -0.0853 0.5239 -0.2775 0.0736 0.0644 0.0907 0.0689 0.0964 0.1098 0.1748 0.0987 0.0768 0.1007 0.0791 0.1010 0.1012 0.0953 0.0930 0.0643 0.0651 0.0942 0.0828 0.0832
va: 2.0672 1.9209 2.9063 3.1864 3.7713 3.9613 3.9006 3.9298 3.9286 3.8416 3.9251 4.2933 3.9520 1.0191 1.0277 0.9998 1.0094 1.0199 1.0022 1.0146 0.9970 1.0040 0.9951 1.0032 0.9945 0.9948 0.9982 0.9998 1.0102 1.0104 1.0034 1.0011 1.0011
dispcorr: -0.011319388 hartree
energy: -615.072509923080
dipole: 3.60226 -3.50266 0.09960 -7.51657 7.42130 -0.09527 1.45197 -2.59875 -1.14677
magnitude: 1.15503 au
magnitude: 2.93584 debye
