program: Orca
programVersion: 5.0.2
elementType: O O N N C C C C C C C C C H H H H H H H H H H H H H H H H H H H H
charge: 0
multiplicity: 1
keywords: wb97x-d3
keywords: def2-TZVPP
keywords: def2/J RIJCOSX
keywords: DEFGRID2
keywords: scfconv7
keywords: smallprint printgap noloewdin
keywords: NOSOSCF
formula: C9H20N2O2
InChI: InChI=1/C9H20N2O2/c1-4-8-13-9(12)10-6-5-7-11(2)3/h10H,4-8H2,1-3H3
33 atoms
O  -2.528463 -0.690286 0.291607
O  -1.202698 0.491473 -1.104843
N  4.196979 -0.605229 0.237327
N  -0.647918 0.167336 1.074938
C  1.730953 -0.314371 0.544965
C  3.101593 0.333515 0.424175
C  0.69053 0.709243 0.980563
C  5.454959 0.115635 0.261696
C  4.070797 -1.313785 -1.021736
C  -3.556267 -0.797886 -0.70209
C  -4.430654 0.437268 -0.778689
C  -1.435609 0.024351 -0.001826
C  -5.072438 0.813146 0.547947
H  1.421464 -0.754274 -0.406279
H  1.765852 -1.12355 1.27951
H  3.301141 0.896902 1.34071
H  3.073565 1.077755 -0.391662
H  0.949343 1.107209 1.961879
H  0.679738 1.559731 0.29819
H  -0.882021 -0.352893 1.906719
H  5.572685 0.638996 1.211475
H  5.546438 0.861142 -0.542846
H  6.290041 -0.579142 0.164236
H  4.936482 -1.959777 -1.170663
H  4.003376 -0.641707 -1.891216
H  3.18982 -1.954784 -1.027909
H  -4.14804 -1.656614 -0.384268
H  -3.123873 -1.037795 -1.674999
H  -3.863218 1.281497 -1.176372
H  -5.207619 0.220293 -1.516521
H  -4.331775 1.117608 1.288162
H  -5.763275 1.647038 0.422298
H  -5.637755 -0.021844 0.96639
elementType: O N C H
totalener: -615.06032306 hartree
nucrepener: 831.68229218 hartree
electener: -1446.74261524 hartree
oneelecener: -2485.30260050 hartree
twoeener: 1038.55998526 hartree
cpcmener: -0.02674485 hartree
kineticenergy: 612.20376625 hartree
xcener: -59.908794731318 hartree
chargesum: -0.0000000
charge: -0.344718 -0.576521 -0.229891 -0.243202 -0.077923 -0.120977 -0.037127 -0.193286 -0.202899 0.019534 -0.105556 0.533795 -0.265657 0.076294 0.063857 0.086105 0.072526 0.106617 0.090706 0.177450 0.098839 0.076119 0.100751 0.101555 0.080088 0.100575 0.112089 0.103774 0.066833 0.075827 0.080421 0.093045 0.080957
qa: -0.3447 -0.5765 -0.2299 -0.2432 -0.0779 -0.1210 -0.0371 -0.1933 -0.2029 0.0195 -0.1056 0.5338 -0.2657 0.0763 0.0639 0.0861 0.0725 0.1066 0.0907 0.1775 0.0988 0.0761 0.1008 0.1016 0.0801 0.1006 0.1121 0.1038 0.0668 0.0758 0.0804 0.0930 0.0810
va: 2.0561 1.9172 2.8938 3.2010 3.7915 3.9522 3.8800 3.9287 3.9312 3.8515 3.8628 4.2829 3.9257 1.0243 1.0292 1.0011 1.0076 1.0044 1.0179 1.0141 0.9962 1.0035 0.9951 0.9950 1.0032 0.9942 0.9969 1.0165 1.0226 1.0131 1.0089 1.0046 1.0011
dispcorr: -0.011351263 hartree
energy: -615.071674321552
dipole: 6.80638 -6.93252 -0.12614 1.18926 -1.43639 -0.24713 -0.29695 1.30526 1.00831
magnitude: 1.04579 au
magnitude: 2.65819 debye
