program: Orca
programVersion: 5.0.2
elementType: O O N N C C C C C C C C C H H H H H H H H H H H H H H H H H H H H
charge: 0
multiplicity: 1
keywords: wb97x-d3
keywords: def2-TZVPP
keywords: def2/J RIJCOSX
keywords: DEFGRID2
keywords: scfconv7
keywords: smallprint printgap noloewdin
keywords: NOSOSCF
formula: C9H20N2O2
InChI: InChI=1/C9H20N2O2/c1-4-8-13-9(12)10-6-5-7-11(2)3/h10H,4-8H2,1-3H3
33 atoms
O  -2.028365 0.420952 0.445309
O  -0.773966 1.041078 -1.32249
N  3.223306 -1.274033 0.220126
N  -0.12992 1.488644 0.816116
C  2.304523 0.973809 0.800611
C  2.236472 -0.251736 -0.097287
C  1.197919 1.983542 0.521662
C  4.569891 -0.812807 -0.056617
C  2.950643 -2.4652 -0.55978
C  -3.031462 -0.105884 -0.430425
C  -4.108252 -0.742114 0.420879
C  -0.952012 0.984029 -0.117073
C  -5.226156 -1.29457 -0.449854
H  2.255761 0.668488 1.849689
H  3.25446 1.497574 0.67087
H  2.31929 0.068018 -1.150808
H  1.252703 -0.715758 0.006963
H  1.36865 2.874951 1.125517
H  1.227391 2.30726 -0.517908
H  -0.347503 1.305403 1.784275
H  5.282304 -1.616249 0.133109
H  4.84594 0.016747 0.593353
H  4.708602 -0.483784 -1.098102
H  1.951382 -2.841979 -0.337706
H  3.661527 -3.252817 -0.30723
H  3.009862 -2.300142 -1.646278
H  -2.593111 -0.847018 -1.103494
H  -3.452497 0.697917 -1.040505
H  -3.675101 -1.545836 1.021251
H  -4.513625 -0.003717 1.116699
H  -4.854891 -2.044935 -1.149865
H  -5.996242 -1.767274 0.159093
H  -5.705104 -0.506262 -1.032709
elementType: O N C H
totalener: -615.06112398 hartree
nucrepener: 842.15024752 hartree
electener: -1457.21137151 hartree
oneelecener: -2506.18036773 hartree
twoeener: 1048.96899622 hartree
cpcmener: -0.02717116 hartree
kineticenergy: 612.20212517 hartree
xcener: -59.909115334444 hartree
chargesum: -0.0000000
charge: -0.334397 -0.570833 -0.229961 -0.233229 -0.063389 -0.128421 -0.054690 -0.198617 -0.193828 0.033063 -0.085785 0.522998 -0.277709 0.063293 0.073485 0.069519 0.091946 0.108616 0.097433 0.175137 0.100645 0.100888 0.078303 0.098292 0.100450 0.077254 0.093743 0.095224 0.065690 0.064412 0.082686 0.094213 0.083574
qa: -0.3344 -0.5708 -0.2300 -0.2332 -0.0634 -0.1284 -0.0547 -0.1986 -0.1938 0.0331 -0.0858 0.5230 -0.2777 0.0633 0.0735 0.0695 0.0919 0.1086 0.0974 0.1751 0.1006 0.1009 0.0783 0.0983 0.1004 0.0773 0.0937 0.0952 0.0657 0.0644 0.0827 0.0942 0.0836
va: 2.0659 1.9241 2.9082 3.1858 3.7708 3.9596 3.9024 3.9283 3.9288 3.8419 3.9247 4.2935 3.9519 1.0281 1.0211 1.0115 0.9998 1.0026 1.0191 1.0143 0.9945 0.9944 1.0042 0.9975 0.9951 1.0030 0.9997 0.9981 1.0102 1.0103 1.0011 1.0034 1.0011
dispcorr: -0.011367100 hartree
energy: -615.072491084532
dipole: 3.54588 -3.54777 -0.00189 -7.64708 7.60297 -0.04411 -0.86747 1.99901 1.13154
magnitude: 1.13240 au
magnitude: 2.87833 debye
