program: Orca
programVersion: 5.0.2
elementType: O O N N C C C C C C C C C H H H H H H H H H H H H H H H H H H H H
charge: 0
multiplicity: 1
keywords: wb97x-d3
keywords: def2-TZVPP
keywords: def2/J RIJCOSX
keywords: DEFGRID2
keywords: scfconv7
keywords: smallprint printgap noloewdin
keywords: NOSOSCF
formula: C9H20N2O2
InChI: InChI=1/C9H20N2O2/c1-4-8-13-9(12)10-6-5-7-11(2)3/h10H,4-8H2,1-3H3
33 atoms
O  -1.69699 0.251868 0.372926
O  -1.120232 2.251394 -0.487655
N  2.18509 -1.085284 0.203708
N  0.275805 1.097948 0.901728
C  2.297392 1.318314 -0.539841
C  3.034266 0.028006 -0.205887
C  1.465903 1.873772 0.609081
C  1.359143 -1.550418 -0.894813
C  3.010142 -2.176415 0.686389
C  -2.985373 0.325861 -0.249504
C  -3.752205 -0.923603 0.11989
C  -0.856715 1.275657 0.195147
C  -3.126717 -2.210318 -0.397122
H  3.057308 2.060492 -0.797354
H  1.673857 1.208669 -1.43126
H  3.721849 0.238087 0.618496
H  3.664316 -0.254883 -1.066313
H  2.071584 1.90877 1.516143
H  1.170686 2.900675 0.400594
H  0.471017 0.1492 1.193678
H  0.701939 -0.76356 -1.262505
H  0.723233 -2.372468 -0.562612
H  1.951545 -1.910196 -1.750097
H  3.606777 -1.851162 1.539698
H  3.700523 -2.565746 -0.076837
H  2.38274 -3.004708 1.018355
H  -2.872814 0.398439 -1.334545
H  -3.516149 1.215142 0.097738
H  -3.878159 -0.969218 1.204689
H  -4.75511 -0.809304 -0.298111
H  -3.750877 -3.069138 -0.149536
H  -3.016587 -2.186419 -1.48283
H  -2.14092 -2.392397 0.032354
elementType: O N C H
totalener: -615.05822987 hartree
nucrepener: 883.87144568 hartree
electener: -1498.92967556 hartree
oneelecener: -2589.52555765 hartree
twoeener: 1090.59588209 hartree
cpcmener: -0.02319955 hartree
kineticenergy: 612.20811914 hartree
xcener: -59.910032442437 hartree
chargesum: 0.0000000
charge: -0.331176 -0.568039 -0.245013 -0.248081 -0.131532 -0.083690 -0.042823 -0.211264 -0.199368 0.020417 -0.097647 0.518943 -0.258795 0.086199 0.080048 0.091561 0.083443 0.101734 0.096689 0.175570 0.094568 0.109131 0.093412 0.100639 0.078186 0.100265 0.098587 0.106386 0.064291 0.067073 0.094205 0.080635 0.075446
qa: -0.3312 -0.5680 -0.2450 -0.2481 -0.1315 -0.0837 -0.0428 -0.2113 -0.1994 0.0204 -0.0976 0.5189 -0.2588 0.0862 0.0800 0.0916 0.0834 0.1017 0.0967 0.1756 0.0946 0.1091 0.0934 0.1006 0.0782 0.1003 0.0986 0.1064 0.0643 0.0671 0.0942 0.0806 0.0754
va: 2.0617 1.9327 2.8631 3.1393 3.8482 3.8890 3.8861 3.9183 3.9249 3.8423 3.9413 4.2999 3.9185 1.0175 1.0115 1.0010 1.0134 1.0040 1.0249 1.0548 0.9969 0.9921 1.0091 0.9976 1.0029 0.9963 0.9996 1.0029 1.0139 1.0116 1.0056 1.0016 1.0087
dispcorr: -0.013504383 hartree
energy: -615.071734253795
dipole: 4.65571 -3.79363 0.86207 -11.64287 10.15639 -1.48648 -2.71637 2.87278 0.15641
magnitude: 1.72547 au
magnitude: 4.38580 debye
