program: Orca
programVersion: 5.0.2
elementType: O O N N C C C C C C C C C H H H H H H H H H H H H H H H H H H H H
charge: 0
multiplicity: 1
keywords: wb97x-d3
keywords: def2-TZVPP
keywords: def2/J RIJCOSX
keywords: DEFGRID2
keywords: scfconv7
keywords: smallprint printgap noloewdin
keywords: NOSOSCF
formula: C9H20N2O2
InChI: InChI=1/C9H20N2O2/c1-4-8-13-9(12)10-6-5-7-11(2)3/h10H,4-8H2,1-3H3
33 atoms
O  -2.178638 0.937412 0.921613
O  -1.446423 1.420278 -1.164523
N  3.048694 -1.496109 0.267005
N  -0.090581 1.602928 0.648153
C  1.827324 0.576599 -0.57756
C  2.32783 -0.273914 0.589368
C  1.128342 1.842926 -0.09844
C  2.224444 -2.450438 -0.445196
C  4.27649 -1.240675 -0.457301
C  -3.474086 0.534818 0.458811
C  -3.608929 -0.973893 0.445678
C  -1.250475 1.316239 0.034713
C  -2.667465 -1.68551 -0.514069
H  2.665085 0.88477 -1.208712
H  1.146567 0.007163 -1.216458
H  1.481071 -0.552554 1.223147
H  2.981708 0.344915 1.212357
H  1.79621 2.412276 0.549309
H  0.900368 2.490303 -0.944298
H  -0.000249 1.347589 1.619758
H  2.738914 -3.410733 -0.512197
H  1.967352 -2.150494 -1.470421
H  1.290536 -2.617843 0.094118
H  4.8651 -2.157143 -0.527723
H  4.881595 -0.505722 0.075772
H  4.131422 -0.872333 -1.482187
H  -3.682148 0.956458 -0.525148
H  -4.18485 0.970268 1.161475
H  -3.47338 -1.360914 1.458848
H  -4.645161 -1.190938 0.173921
H  -1.619921 -1.562309 -0.232321
H  -2.869402 -2.756989 -0.5203
H  -2.786169 -1.323277 -1.536311
elementType: O N C H
totalener: -615.05809942 hartree
nucrepener: 867.95367610 hartree
electener: -1483.01177552 hartree
oneelecener: -2557.64676733 hartree
twoeener: 1074.63499181 hartree
cpcmener: -0.02713237 hartree
kineticenergy: 612.20331496 hartree
xcener: -59.912914285055 hartree
chargesum: 0.0000000
charge: -0.338253 -0.567297 -0.248208 -0.235543 -0.113639 -0.085112 -0.060545 -0.209014 -0.208260 0.019310 -0.078913 0.519588 -0.273007 0.084858 0.073272 0.087174 0.090597 0.106766 0.100282 0.179746 0.103701 0.080875 0.097805 0.101906 0.100764 0.079895 0.096635 0.107378 0.064317 0.066365 0.075430 0.096297 0.084830
qa: -0.3383 -0.5673 -0.2482 -0.2355 -0.1136 -0.0851 -0.0605 -0.2090 -0.2083 0.0193 -0.0789 0.5196 -0.2730 0.0849 0.0733 0.0872 0.0906 0.1068 0.1003 0.1797 0.1037 0.0809 0.0978 0.1019 0.1008 0.0799 0.0966 0.1074 0.0643 0.0664 0.0754 0.0963 0.0848
va: 2.0640 1.9265 2.8905 3.1816 3.7769 3.9022 3.9234 3.9450 3.9451 3.8562 3.8745 4.3116 3.9379 1.0151 1.0192 1.0127 1.0021 1.0024 1.0151 1.0125 0.9952 0.9927 0.9949 0.9939 0.9939 0.9927 1.0186 0.9999 1.0122 1.0149 1.0008 1.0055 1.0053
dispcorr: -0.013108291 hartree
energy: -615.071207713693
dipole: 7.02922 -6.72420 0.30501 -10.30997 10.08132 -0.22865 -2.39778 3.36982 0.97204
magnitude: 1.04412 au
magnitude: 2.65394 debye
