program: Orca
programVersion: 5.0.2
elementType: O O N N C C C C C C C C C H H H H H H H H H H H H H H H H H H H H
charge: 0
multiplicity: 1
keywords: wb97x-d3
keywords: def2-TZVPP
keywords: def2/J RIJCOSX
keywords: DEFGRID2
keywords: scfconv7
keywords: smallprint printgap noloewdin
keywords: NOSOSCF
formula: C9H20N2O2
InChI: InChI=1/C9H20N2O2/c1-4-8-13-9(12)10-6-5-7-11(2)3/h10H,4-8H2,1-3H3
33 atoms
O  -1.686037 0.250584 0.407086
O  -1.152535 2.285247 -0.396152
N  2.170509 -1.080292 0.184983
N  0.291791 1.097406 0.913172
C  2.276965 1.319358 -0.569751
C  3.016057 0.026631 -0.249373
C  1.473562 1.876965 0.597914
C  1.329251 -1.557746 -0.896566
C  2.997796 -2.167148 0.672967
C  -2.991654 0.331708 -0.176013
C  -3.712581 -0.962793 0.122495
C  -0.860375 1.28789 0.242099
C  -3.063692 -2.187367 -0.504728
H  3.033105 2.058282 -0.846674
H  1.631672 1.20952 -1.445641
H  3.723647 0.23648 0.557812
H  3.624107 -0.262923 -1.122964
H  2.099989 1.911307 1.490835
H  1.173065 2.903532 0.396516
H  0.500102 0.140633 1.169607
H  1.910366 -1.931011 -1.753654
H  0.670248 -0.77356 -1.267052
H  0.695809 -2.373627 -0.544967
H  3.677026 -2.569837 -0.092607
H  2.371431 -2.987628 1.024633
H  3.605892 -1.831398 1.513766
H  -2.911549 0.483214 -1.255508
H  -3.535673 1.179217 0.247065
H  -3.805512 -1.09108 1.203957
H  -4.729985 -0.849759 -0.25891
H  -2.991874 -2.082974 -1.588874
H  -2.057913 -2.363884 -0.121492
H  -3.650541 -3.08285 -0.299382
elementType: O N C H
totalener: -615.05818078 hartree
nucrepener: 885.09546934 hartree
electener: -1500.15365011 hartree
oneelecener: -2591.95641590 hartree
twoeener: 1091.80276578 hartree
cpcmener: -0.02326543 hartree
kineticenergy: 612.21657809 hartree
xcener: -59.911754009304 hartree
chargesum: 0.0000000
charge: -0.330342 -0.567645 -0.244054 -0.250195 -0.132632 -0.083222 -0.041318 -0.214549 -0.198210 0.019621 -0.096358 0.517456 -0.257605 0.085911 0.080378 0.091827 0.083478 0.101211 0.096145 0.176054 0.094415 0.094839 0.110583 0.078883 0.100240 0.100528 0.097852 0.107114 0.064095 0.067149 0.080793 0.073427 0.094132
qa: -0.3303 -0.5676 -0.2441 -0.2502 -0.1326 -0.0832 -0.0413 -0.2145 -0.1982 0.0196 -0.0964 0.5175 -0.2576 0.0859 0.0804 0.0918 0.0835 0.1012 0.0961 0.1761 0.0944 0.0948 0.1106 0.0789 0.1002 0.1005 0.0979 0.1071 0.0641 0.0671 0.0808 0.0734 0.0941
va: 2.0619 1.9336 2.8653 3.1354 3.8521 3.8883 3.8846 3.9169 3.9227 3.8433 3.9399 4.3014 3.9190 1.0176 1.0109 1.0009 1.0137 1.0040 1.0260 1.0572 1.0094 0.9973 0.9907 1.0027 0.9964 0.9977 1.0003 1.0023 1.0138 1.0117 1.0015 1.0090 1.0059
dispcorr: -0.013577921 hartree
energy: -615.071758698809
dipole: 4.71999 -3.82543 0.89456 -11.71582 10.18893 -1.52689 -3.14179 3.21696 0.07517
magnitude: 1.77124 au
magnitude: 4.50213 debye
